{"text_format":"1","workbook":"xlsx","n_sheets":4,"sheets":["IDEXX MPN Generator","File Upload","Lists","Table"],"not_rendered":{"charts":0,"images":0,"macros":1,"external_links":0,"defined_names":0,"comments":0,"pivot_tables":1},"unopened":[],"bounds":{"document_bytes":16777216,"sheet_cells":100000,"rows_first":2000,"rows_last":500,"rows_between":2000,"halvings":0,"cell_chars":16384,"cell_head_chars":4096},"cells_cut":0,"cells_raw":0,"read":"whole","date_system":"1900"}

{"sheet":"IDEXX MPN Generator","index":0,"n_rows":5,"n_cols":17,"rows_kept":5,"cut":false,"hidden":false,"merged":[]}
["Instructions:  1) Copy data from Bacteria Record Sheet to the form below.  2) Calculate MPN. 3) Review Qualifier Codes"]
["4) Press Format Upload File Key.  5) Save File Upload worksheet as a .CSV in upload directory."]
["Lab ID","RID","Method","Collection Date/Time","Incubation Start Date/Time","Date of Analysis","Analyte Name","Start Temp","End Temp","Quanti-Tray/2000 Positive Large Wells","Quanti-Tray/2000 Positive Small Wells","MPN","Lower95 /Tray","Upper95 /Tray","Qualifier","Comments","Analyst"]
["SWQB Lab Unit",2468182,"Colilert/2000","2015-09-22T15:37:00","2015-09-22T15:30:00","2015-09-23T19:50:00","Total Coliform",35,35.1,49,48,{"$f":"IF(AND($J4=0,$K4=0),\"<1\",IF(AND($J4>=49,$K4>=48),\">2419.6\",VLOOKUP($J4,Table!$B$22:$BA$172,$K4+4)))","v":">2419.6"},{"$f":"IF(AND($J4=0,$K4=0),\"<1\",IF(AND($J4>=49,$K4>=48),\">1630.4\",VLOOKUP($J4,Table!$C$22:$BA$172,$K4+3)))","v":">1630.4"},{"$f":"IF(AND($J4=0,$K4=0),\"<1\",IF(AND($J4>=49,$K4>=48),\">4716.10\",VLOOKUP($J4,Table!$A$22:$BA$172,$K4+5)))","v":">4716.10"},{"$f":"CONCATENATE(IF(L4=\">2419.6\",\"E\",\"\"),IF(L4=\"<1\",\"U\",\"\"),,IF((E4-D4)>0.3334,\"I1\",\"\"),IF(OR(IF(C4=\"Colilert-182000\",(F4-E4)<0.75,(F4-E4)<1),IF(C4=\"Colilert-182000\",(F4-E4)>0.91667,(F4-E4)>1.16667)),\"Er\",\"\"),IF(OR(H4<34.5,I4<34.5),\"Er\",IF(OR(AND(H4>35.5,H4<38.1),AND(I4>35.5,I4<38.1)),\"Ea\",IF(OR(H4>38,I4>38),\"Er\",\"\"))))","v":"EEr"}]
["SWQB Lab Unit",2468182,"Colilert/2000","2015-09-22T15:37:00","2015-09-22T15:30:00","2015-09-23T19:50:00","Escherichia coli",35,35.1,37,7,{"$f":"IF(AND($J5=0,$K5=0),\"<1\",IF(AND($J5>=49,$K5>=48),\">2419.6\",VLOOKUP($J5,Table!$B$22:$BA$172,$K5+4)))","v":77.569999999999993},{"$f":"IF(AND($J5=0,$K5=0),\"<1\",IF(AND($J5>=49,$K5>=48),\">1630.4\",VLOOKUP($J5,Table!$C$22:$BA$172,$K5+3)))","v":55.3},{"$f":"IF(AND($J5=0,$K5=0),\"<1\",IF(AND($J5>=49,$K5>=48),\">4716.10\",VLOOKUP($J5,Table!$A$22:$BA$172,$K5+5)))","v":104.52},{"$f":"CONCATENATE(IF(L5=\">2419.6\",\"E\",\"\"),IF(L5=\"<1\",\"U\",\"\"),,IF((E5-D5)>0.3334,\"I1\",\"\"),IF(OR(IF(C5=\"Colilert-182000\",(F5-E5)<0.75,(F5-E5)<1),IF(C5=\"Colilert-182000\",(F5-E5)>0.91667,(F5-E5)>1.16667)),\"Er\",\"\"),IF(OR(H5<34.5,I5<34.5),\"Er\",IF(OR(AND(H5>35.5,H5<38.1),AND(I5>35.5,I5<38.1)),\"Ea\",IF(OR(H5>38,I5>38),\"Er\",\"\"))))","v":"Er"}]

{"sheet":"File Upload","index":1,"n_rows":3,"n_cols":16,"rows_kept":3,"cut":false,"hidden":false,"merged":[]}
["Lab ID","RID","Method","Date of Analysis","Analyte Name","Reported Value","Less Than","Greater Than","SDL","Qualifier Code","Comments","Units","MDL","PQL","Sample Fraction","Dilution Factor"]
["SWQB Lab Unit",2468182,"Colilert/2000","2015-09-23T19:50:00","Total Coliform",{"$f":"IF('IDEXX MPN Generator'!L4=\">2419.6\",\"2419.6\",IF('IDEXX MPN Generator'!L4=\"<1\",\"1\",'IDEXX MPN Generator'!L4))","v":"2419.6"},{"$f":"IF('IDEXX MPN Generator'!L4=\"<1\",\"TRUE\",\"FALSE\")","v":"FALSE"},{"$f":"IF('IDEXX MPN Generator'!L4=\">2419.6\",\"TRUE\",\"FALSE\")","v":"TRUE"},{"$f":"IF('IDEXX MPN Generator'!L4=\">2419.6\",\"2419.6\",\"1\")","v":"2419.6"},{"$f":"'IDEXX MPN Generator'!O4","v":"EEr"},{"$f":"CONCATENATE(\"Start Temp=\",'IDEXX MPN Generator'!H4,\";\",\"End Temp=\",'IDEXX MPN Generator'!I4,\";\",\"Large/Small=\",'IDEXX MPN Generator'!J4,\"/\",'IDEXX MPN Generator'!K4,\";\",\"95% CI Low/High=\",'IDEXX MPN Generator'!M4,\"/\",'IDEXX MPN Generator'!N4,\";\",'IDEXX MPN Generator'!P4)","v":"Start Temp=35;End Temp=35.1;Large/Small=49/48;95% CI Low/High=>1630.4/>4716.10;"},"MPN/100ml",1,1,"Total",1]
["SWQB Lab Unit",2468182,"Colilert/2000","2015-09-23T19:50:00","Escherichia coli",{"$f":"IF('IDEXX MPN Generator'!L5=\">2419.6\",\"2419.6\",IF('IDEXX MPN Generator'!L5=\"<1\",\"1\",'IDEXX MPN Generator'!L5))","v":77.569999999999993},{"$f":"IF('IDEXX MPN Generator'!L5=\"<1\",\"TRUE\",\"FALSE\")","v":"FALSE"},{"$f":"IF('IDEXX MPN Generator'!L5=\">2419.6\",\"TRUE\",\"FALSE\")","v":"FALSE"},{"$f":"IF('IDEXX MPN Generator'!L5=\">2419.6\",\"2419.6\",\"1\")","v":"1"},{"$f":"'IDEXX MPN Generator'!O5","v":"Er"},{"$f":"CONCATENATE(\"Start Temp=\",'IDEXX MPN Generator'!H5,\";\",\"End Temp=\",'IDEXX MPN Generator'!I5,\";\",\"Large/Small=\",'IDEXX MPN Generator'!J5,\"/\",'IDEXX MPN Generator'!K5,\";\",\"95% CI Low/High=\",'IDEXX MPN Generator'!M5,\"/\",'IDEXX MPN Generator'!N5,\";\",'IDEXX MPN Generator'!P5)","v":"Start Temp=35;End Temp=35.1;Large/Small=37/7;95% CI Low/High=55.3/104.52;"},"MPN/100ml",1,1,"Total",1]

{"sheet":"Lists","index":2,"n_rows":6,"n_cols":7,"rows_kept":6,"cut":false,"hidden":false,"merged":[]}
["Lab ID","Method",null,"Analysis",null,"Qualifiers"]
["SWQB Field","Colilert-182000",null,"Total Coliform",null,"E","Analyte value exceeds calibration range"]
["SWQB Lab Unit","Colilert/2000",null,"Escherichia coli",null,"U","Result below method detection limit"]
["SLD",null,null,null,null,"I1","Estimated-sample collection time to incubation start exceeds eight hours"]
["Other",null,null,null,null,"Ea","Estimated-Incubation temperature between 35.5 and 38.0° Celsius  "]
[null,null,null,null,null,"Er","Rejected-Incubation temperature < 34.5 or >38.0° Celsius: or, incubation period shorter or 4 hours greater than prescribed in method."]

{"sheet":"Table","index":3,"n_rows":172,"n_cols":53,"rows_kept":172,"cut":false,"hidden":false,"merged":[]}
[null,null,null,"MPN and 95% Conf. Int. Calculator"]
[null,null,null,"for IDEXX Colilert Quanti-Tray 2000"]
[]
["This pivot table- lookup was developed by David Thoma, National Park Service Inventory and Monitoring"]
["The values in the table are from IDEXX laboratories for the Quanti-Tray 2000 system"]
[]
["1 IDEXX Drive",null,"Mention of trade names or commercial products does not constitute endorsement or recommendation for use by the National Park Service."]
["Westbrook Maine 04092",null,"NPS makes no warrantee as to the reliability of this application or its suitability for the end users purpose."]
["United States"]
["Telephone:  1-800-321-0207",null,null,"big wells (+)","sm. wells (+)"]
["Fax:  207-856-0630",null,"Tot. Coli",1,1,"enter well counts more yellow than comparator in blue cells"]
["water@idexx.com",null,"E. Coli",1,1,"enter flourescent well counts in yellow cells"]
["www.idexx.com"]
[]
[null,null,"95L","MPN","95H"]
["Tot. Coli (MPN/100mL)",null,{"$f":"IF(AND(D11=0,E11=0),\"<1\",IF(AND(D11>=49,E11>=48),\">1630.4\",VLOOKUP(D11,C22:BA172,E11+3)))","v":0.25},{"$f":"IF(AND(D11=0,E11=0),\"<1\",IF(AND(D11>=49,E11>=48),\">2419.6\",VLOOKUP(D11,B22:BA172,E11+4)))","v":2.0099999999999998},{"$f":"IF(AND(D11>=49,E11>=48),\">4716.1\",VLOOKUP(D11,A22:BA172,E11+5))","v":5.92},"results from look up table for Tot. Coli"]
["E. Coli (MPN/100mL)",null,{"$f":"IF(AND(D12=0,E12=0),\"<1\",IF(AND(D11>=49,E11>=48),\">1630.4\",VLOOKUP(D12,C22:BA172,E11+3)))","v":0.25},{"$f":"IF(AND(D12=0,E12=0),\"<1\",IF(AND(D12>=49,E12>=48),\">2419.6\",VLOOKUP(D12,B22:BA172,E12+4)))","v":2.0099999999999998},{"$f":"IF(AND(D12>=49,E12>=48),\"4716.1\",VLOOKUP(D12,A22:BA172,E12+5))","v":5.92},"results from look up table for E. Coli"]
[null,null,null,null,null,"MPN is the most probable number"]
[null,null,null,null,null,"95L and 95H refer to the 95% lower and upper confidence interval bounds "]
[]
[null,null,null,null,"SWells"]
["Lwells","Lwells","LWells","Data",0,1,2,3,4,5,6,7,8,9,10,11,12,13,14,15,16,17,18,19,20,21,22,23,24,25,26,27,28,29,30,31,32,33,34,35,36,37,38,39,40,41,42,43,44,45,46,47,48]
[null,null,0,"Sum of 95L_Limit",0,0.03,0.25,0.61,1.1299999999999999,1.7,2.2799999999999998,2.93,3.67,4.4800000000000004,5.18,5.91,6.93,7.76,8.64,8.9700000000000006,9.58,10.52,11.5,12.53,13.2,13.87,14.54,15.67,16.36,17.55,18.27,19.52,19.71,21,21.74,22.49,23.87,24.63,25.4,26.17,27.66,28.45,29.24,30.04,30.84,31.63,33.270000000000003,34.090000000000003,34.92,35.74,37.49,38.340000000000003,39.19]
[null,{"$f":"C23","v":0},null,"Sum of MPN",0,0.99,1.99,2.98,3.98,4.9800000000000004,5.98,6.98,7.99,8.99,10,11.01,12.02,13.03,14.05,15.06,16.079999999999998,17.100000000000001,18.12,19.14,20.170000000000002,21.19,22.22,23.25,24.28,25.31,26.35,27.38,28.42,29.46,30.5,31.54,32.590000000000003,33.630000000000003,34.68,35.729999999999997,36.78,37.840000000000003,38.89,39.950000000000003,41.01,42.07,43.13,44.19,45.26,46.33,47.4,48.47,49.54]
[{"$f":"C23","v":0},null,null,"Sum of 95U_Limit",3.67,3.67,5.59,7.3,8.94,10.54,12.12,13.71,15.28,15.78,16.93,18.48,20.100000000000001,21.17,21.85,23.44,24.93,25.71,26.89,28.56,29.32,30.47,31.84,33.1,34.17,35.200000000000003,36.450000000000003,37.67,38.590000000000003,39.89,41.18,42.25,43.43,44.43,45.68,46.79,47.97,49.04,50.32,51.16,52.84,53.68,54.74,56.12,57.11,58.1,59.47,60.69,61.61]
[null,null,1,"Sum of 95L_Limit",0.05,0.25,0.62,1.1399999999999999,1.72,2.2999999999999998,2.96,3.7,4.34,5.22,5.97,6.75,7.58,8.7200000000000006,9.35,9.67,10.62,11.61,12.64,13.32,14,14.68,15.82,17,17.22,18.440000000000001,19.170000000000002,20.46,21.21,21.96,22.71,23.46,24.88,25.66,26.43,27.94,28.74,29.54,30.35,31.15,32.79,33.619999999999997,34.450000000000003,35.28,36.119999999999997,36.950000000000003,38.74,39.6,40.46]
[null,{"$f":"C26","v":1},null,"Sum of MPN",1,2.0099999999999998,3.01,4.0199999999999996,5.03,6.04,7.05,8.06,9.08,10.09,11.11,12.13,13.15,14.18,15.2,16.23,17.260000000000002,18.29,19.32,20.36,21.39,22.43,23.47,24.51,25.56,26.6,27.65,28.7,29.75,30.8,31.86,32.909999999999997,33.97,35.03,36.090000000000003,37.159999999999997,38.22,39.29,40.36,41.43,42.5,43.58,44.65,45.73,46.81,47.9,48.98,50.07,51.16]
[{"$f":"C26","v":1},null,null,"Sum of 95U_Limit",5.49,5.92,7.33,8.94,10.54,12.12,13.71,15.28,16.16,17.16,18.48,20.100000000000001,21.74,22.22,23.55,25.1,26.37,27.04,28.63,29.97,30.69,32.299999999999997,33.14,34.47,35.69,37.06,38.090000000000003,39.159999999999997,40.57,41.64,42.71,43.97,44.92,46.37,47.21,48.77,49.56,51.01,52,53.07,54.51,55.35,56.57,57.95,58.86,60.08,61.3,62.52,63.59]
[null,null,2,"Sum of 95L_Limit",0.26,0.68,1.1499999999999999,1.63,2.3199999999999998,2.99,3.73,4.38,5.27,6.02,6.82,7.65,8.52,9.44,9.76,10.38,11.36,12.38,13.45,14.13,14.82,15.97,17.16,17.89,18.100000000000001,19.36,20.66,21.42,22.18,23.57,24.35,25.13,25.92,26.7,28.23,29.04,29.85,30.66,31.48,32.29,33.97,34.81,35.659999999999997,36.5,37.35,38.19,40.03,40.9,41.78]
[null,{"$f":"C29","v":2},null,"Sum of MPN",2.02,3.04,4.05,5.07,6.09,7.11,8.1300000000000008,9.16,10.19,11.21,12.24,13.28,14.31,15.35,16.38,17.420000000000002,18.46,19.510000000000002,20.55,21.6,22.65,23.7,24.75,25.81,26.86,27.92,28.98,30.04,31.11,32.18,33.24,34.31,35.39,36.46,37.54,38.61,39.69,40.78,41.86,42.95,44.03,45.12,46.22,47.31,48.41,49.51,50.61,51.71,52.81]
[{"$f":"C29","v":2},null,null,"Sum of 95U_Limit",7.13,7.37,8.9499999999999993,10.55,12.12,13.71,15.28,16.87,17.809999999999999,18.559999999999999,20.12,21.74,22.88,23.95,25.14,26.81,27.5,28.83,30.35,31.19,32.56,33.75,35.04,36.11,37.1,38.479999999999997,39.700000000000003,40.57,42.02,43.36,44.35,45.68,46.64,47.97,48.93,50.32,51.16,52.84,53.68,54.9,56.19,57.11,58.56,59.7,60.77,61.84,62.98,64.2,65.42]
[null,null,3,"Sum of 95L_Limit",0.69,1.1599999999999999,1.65,2.34,3.01,3.61,4.42,5.12,6.08,6.88,7.72,8.61,9.5299999999999994,10.18,10.48,11.47,12.5,13.58,14.27,14.96,15.66,16.84,18.07,18.809999999999999,19.55,20.87,21.63,22.4,23.17,24.6,25.39,26.18,26.98,27.78,29.34,30.16,30.98,31.81,32.64,34.33,35.18,36.04,36.89,37.75,38.61,40.47,41.35,42.24,43.12]
[null,{"$f":"C32","v":3},null,"Sum of MPN",3.06,4.09,5.12,6.15,7.18,8.2100000000000009,9.24,10.28,11.32,12.36,13.4,14.45,15.49,16.54,17.59,18.64,19.7,20.75,21.81,22.87,23.93,25,26.06,27.13,28.2,29.27,30.35,31.42,32.5,33.58,34.659999999999997,35.75,36.840000000000003,37.93,39.020000000000003,40.11,41.2,42.3,43.4,44.5,45.61,46.71,47.82,48.93,50.04,51.16,52.28,53.39,54.52]
[{"$f":"C32","v":3},null,null,"Sum of 95U_Limit",8.94,9.07,10.55,12.14,13.71,15.29,16.87,18.29,18.84,20.2,21.76,23.4,24.05,25.29,26.87,28.15,29.17,30.43,31.84,32.68,34.17,35.200000000000003,36.450000000000003,37.67,39.090000000000003,40.15,41.26,42.71,43.62,44.92,46.18,47.21,48.58,49.54,51.01,52,53.22,54.51,55.35,56.96,57.95,59.02,60.16,61.53,62.6,63.75,64.97,66.11,67.33]
[null,null,4,"Sum of 95L_Limit",1.65,1.76,2.36,2.9,3.64,4.46,5.17,5.91,6.94,7.79,8.69,9.6199999999999992,10.27,10.93,11.58,12.62,13.71,14.84,15.11,15.81,17.010000000000002,18.25,19,19.75,20.5,21.85,22.63,23.41,24.85,25.65,26.46,27.26,28.07,29.65,30.48,31.31,32.15,32.99,34.700000000000003,35.57,36.43,37.299999999999997,38.159999999999997,40.020000000000003,40.92,41.81,42.71,43.61,44.51]
[null,{"$f":"C35","v":4},null,"Sum of MPN",4.13,5.16,6.2,7.24,8.2899999999999991,9.33,10.38,11.42,12.48,13.53,14.58,15.64,16.7,17.760000000000002,18.82,19.89,20.96,22.02,23.1,24.17,25.25,26.32,27.4,28.49,29.57,30.66,31.75,32.840000000000003,33.93,35.020000000000003,36.119999999999997,37.22,38.32,39.43,40.53,41.64,42.75,43.87,44.98,46.1,47.22,48.34,49.47,50.6,51.72,52.86,53.99,55.13,56.27]
[{"$f":"C35","v":4},null,null,"Sum of 95U_Limit",9.52,10.76,12.24,13.73,15.29,16.87,18.48,19.489999999999998,20.52,21.76,23.4,24.62,25.71,26.89,28.57,29.32,30.69,32.18,33.1,34.47,35.69,37.06,38.090000000000003,39.24,40.57,41.79,42.75,44.2,45.57,46.45,47.97,48.81,50.32,51.16,52.84,53.68,55.2,56.19,57.41,58.63,59.78,60.92,62.45,63.52,64.739999999999995,65.959999999999994,67.25,68.400000000000006,69.39]
[null,null,5,"Sum of 95L_Limit",2.29,2.5099999999999998,2.93,3.67,4.32,5.22,5.97,6.76,7.6,8.48,9.41,10.37,11.03,11.69,12.36,13.43,14.55,15.72,15.97,17.18,17.920000000000002,19.190000000000001,19.95,20.71,22.08,22.87,23.65,24.44,25.92,26.74,27.55,28.37,29.19,30.81,31.65,32.5,33.35,35.08,35.96,36.83,37.71,38.590000000000003,39.47,41.37,42.28,43.19,44.1,45.02,45.93]
[null,{"$f":"C38","v":5},null,"Sum of MPN",5.21,6.26,7.31,8.36,9.42,10.47,11.53,12.59,13.66,14.72,15.79,16.86,17.93,19.010000000000002,20.079999999999998,21.16,22.24,23.33,24.41,25.5,26.59,27.68,28.78,29.87,30.97,32.07,33.18,34.28,35.39,36.5,37.619999999999997,38.729999999999997,39.85,40.97,42.09,43.22,44.35,45.47,46.61,47.74,48.88,50.02,51.16,52.31,53.45,54.6,55.75,56.91,58.07]
[{"$f":"C38","v":5},null,null,"Sum of 95U_Limit",11.94,12.73,13.89,15.29,16.88,18.48,20.100000000000001,21.17,21.85,23.44,25.1,26.37,27.04,28.63,29.97,31.19,32.299999999999997,33.75,35.04,36.11,37.520000000000003,38.479999999999997,39.89,41.18,42.25,43.43,44.88,45.84,47.21,48.47,49.54,51.01,52,53.29,54.51,55.66,57.03,58.02,59.32,60.69,61.84,62.98,64.2,65.42,66.569999999999993,67.790000000000006,69.010000000000005,70.38,71.680000000000007]
[null,null,6,"Sum of 95L_Limit",2.9,3.24,3.71,4.3600000000000003,5.27,6.03,6.83,7.68,8.57,9.5,10.48,11.14,11.81,12.48,13.57,14.7,15.88,16.62,17.36,18.100000000000001,19.39,20.16,20.93,22.31,23.11,23.9,24.7,26.2,27.02,27.85,28.67,29.5,31.14,32,32.85,33.71,35.47,36.36,37.24,38.130000000000003,39.020000000000003,39.92,40.81,42.77,43.69,44.61,45.54,46.47,47.4]
[null,{"$f":"C41","v":6},null,"Sum of MPN",6.32,7.38,8.44,9.51,10.57,11.64,12.72,13.79,14.87,15.95,17.03,18.11,19.2,20.28,21.37,22.47,23.56,24.66,25.76,26.86,27.97,29.07,30.18,31.3,32.409999999999997,33.53,34.65,35.770000000000003,36.89,38.020000000000003,39.15,40.28,41.42,42.55,43.69,44.83,45.98,47.13,48.28,49.43,50.58,51.74,52.9,54.07,55.23,56.4,57.57,58.74,59.92]
[{"$f":"C41","v":6},null,null,"Sum of 95U_Limit",13.71,14.4,15.34,16.93,18.48,20.100000000000001,21.74,22.22,23.55,25.14,26.81,27.5,28.83,30.43,31.84,32.56,34.17,35.200000000000003,36.450000000000003,37.83,39.090000000000003,40.15,41.64,42.71,44.2,45.19,46.45,47.94,48.77,50.34,51.16,52.84,53.75,55.35,56.19,57.57,58.86,60.08,61.3,62.52,63.59,64.81,66.11,67.48,68.7,69.77,70.989999999999995,72.44,73.66]
[null,null,7,"Sum of 95L_Limit",3.56,3.91,4.41,5.1100000000000003,6.09,6.9,7.75,8.65,9.59,10.58,11.61,12.31,12.61,13.71,14.85,15.57,16.79,17.54,18.29,19.59,20.37,21.15,21.93,23.35,24.16,24.96,26.48,27.31,28.15,28.99,30.62,31.49,32.35,33.22,34.090000000000003,34.96,36.770000000000003,37.67,38.57,39.47,40.380000000000003,41.29,43.26,44.2,45.14,46.08,47.02,47.96,48.91]
[null,{"$f":"C44","v":7},null,"Sum of MPN",7.45,8.52,9.6,10.68,11.76,12.84,13.93,15.01,16.100000000000001,17.2,18.29,19.39,20.49,21.59,22.7,23.8,24.91,26.03,27.14,28.26,29.38,30.5,31.63,32.76,33.89,35.020000000000003,36.15,37.29,38.43,39.58,40.72,41.87,43.03,44.18,45.34,46.5,47.66,48.83,49.99,51.16,52.34,53.51,54.69,55.88,57.06,58.25,59.44,60.63,61.83]
[{"$f":"C44","v":7},null,null,"Sum of 95U_Limit",14.87,15.64,16.93,18.54,20.12,21.74,22.88,23.95,25.29,26.87,28.15,29.32,30.47,31.92,33.1,34.47,35.69,37.06,38.130000000000003,39.700000000000003,40.57,42.02,43.36,44.43,45.68,47.21,48.32,49.54,51.01,52,53.45,54.51,55.89,57.11,58.25,59.7,60.77,61.91,63.44,64.66,65.959999999999994,67.25,68.48,69.7,70.84,72.209999999999994,73.430000000000007,74.349999999999994,75.88]
[null,null,8,"Sum of 95L_Limit",4.45,4.45,5.16,5.91,6.71,7.83,8.74,9.69,10.35,11.37,12.43,13.14,13.85,14.56,15.74,16.96,17.72,18.48,19.239999999999998,20.59,21.37,22.16,23.6,24.42,25.24,26.06,27.61,28.46,29.31,30.16,31.84,32.72,33.6,34.479999999999997,35.36,36.25,38.1,39.020000000000003,39.93,40.85,41.77,43.77,44.72,45.67,46.63,47.58,48.54,49.5,50.47]
[null,{"$f":"C47","v":8},null,"Sum of MPN",8.6,9.69,10.78,11.87,12.97,14.06,15.16,16.260000000000002,17.37,18.48,19.59,20.7,21.81,22.93,24.05,25.17,26.3,27.43,28.56,29.69,30.83,31.97,33.11,34.25,35.4,36.549999999999997,37.700000000000003,38.86,40.020000000000003,41.18,42.34,43.51,44.68,45.85,47.03,48.21,49.39,50.57,51.76,52.95,54.14,55.34,56.54,57.74,58.95,60.16,61.37,62.58,63.8]
[{"$f":"C47","v":8},null,null,"Sum of 95U_Limit",16.87,17.16,18.61,20.16,21.76,23.4,24.62,25.71,26.89,28.57,29.97,30.69,32.299999999999997,33.75,35.04,36.11,37.67,38.479999999999997,40.15,41.26,42.71,43.97,44.92,46.45,47.82,48.77,50.34,51.16,52.84,53.75,55.35,56.35,57.95,59.02,60.16,61.61,62.98,64.2,65.42,66.569999999999993,67.790000000000006,69.09,70.38,71.680000000000007,72.98,74.27,75.650000000000006,77.02,77.86]
[null,null,9,"Sum of 95L_Limit",4.68,5.63,5.97,6.78,7.63,8.52,9.4700000000000006,10.45,11.48,12.56,13.27,13.99,14.71,15.9,17.14,17.91,18.68,19.45,20.81,21.61,22.4,23.21,24.69,25.51,26.34,27.92,28.78,29.64,30.5,32.200000000000003,33.090000000000003,33.979999999999997,34.880000000000003,35.770000000000003,36.67,38.549999999999997,39.47,40.4,41.34,42.27,44.3,45.26,46.23,47.2,48.17,49.14,51.35,51.09,53.36]
[null,{"$f":"C50","v":9},null,"Sum of MPN",9.7899999999999991,10.89,11.99,13.1,14.2,15.31,16.43,17.55,18.66,19.79,20.91,22.04,23.17,24.3,25.44,26.58,27.72,28.86,30.01,31.16,32.31,33.47,34.630000000000003,35.79,36.950000000000003,38.119999999999997,39.29,40.47,41.64,42.82,44.01,45.19,46.38,47.57,48.77,49.97,51.17,52.37,53.58,54.79,56,57.22,58.44,59.66,60.89,62.12,63.35,64.59,65.83]
[{"$f":"C50","v":9},null,null,"Sum of 95U_Limit",18.36,19.489999999999998,20.27,21.76,23.44,25.1,26.37,27.04,28.63,30.35,31.19,32.56,34.17,35.200000000000003,36.450000000000003,38.090000000000003,39.159999999999997,40.57,41.79,43.24,44.35,45.68,47.17,47.97,49.54,51.02,52,53.68,54.51,56.12,57.11,58.56,59.78,61.15,62.52,63.59,64.739999999999995,66.11,67.48,69.010000000000005,70.31,71.45,72.52,74.040000000000006,75.42,76.41,77.78,79.31,80.599999999999994]
[null,null,10,"Sum of 95L_Limit",5.69,6.5,7.1,7.71,8.61,9.56,10.56,11.6,12.69,13.41,14.14,14.86,16.07,16.82,18.100000000000001,18.88,19.66,21.03,21.84,23.29,23.46,24.96,25.8,26.64,28.24,29.11,29.98,30.85,31.73,33.47,34.380000000000003,35.28,36.19,37.1,39.01,39.950000000000003,40.89,41.83,42.78,43.73,45.82,46.8,47.78,48.77,49.75,50.74,53.02,54.04,55.06]
[null,{"$f":"C53","v":10},null,"Sum of MPN",11,12.11,13.23,14.35,15.47,16.600000000000001,17.73,18.86,19.989999999999998,21.13,22.27,23.41,24.56,25.71,26.86,28.02,29.18,30.34,31.5,32.67,33.840000000000003,35.01,36.19,37.369999999999997,38.549999999999997,39.74,40.93,42.12,43.32,44.52,45.72,46.92,48.13,49.34,50.56,51.78,53,54.23,55.45,56.69,57.92,59.16,60.4,61.65,62.9,64.150000000000006,65.41,66.67,67.930000000000007]
[{"$f":"C53","v":10},null,null,"Sum of 95U_Limit",20.079999999999998,21.09,22.01,23.55,25.1,26.81,27.5,28.83,30.43,31.84,33.1,34.47,35.69,37.06,38.479999999999997,39.700000000000003,41.18,42.25,43.43,44.92,46.45,47.48,48.77,50.34,51.16,52.84,54.13,55.35,56.8,57.95,59.09,60.69,61.84,62.98,64.510000000000005,65.959999999999994,67.25,68.48,69.7,70.989999999999995,72.290000000000006,73.66,75.040000000000006,76.260000000000005,77.63,79.23,79.989999999999995,81.37,83.2]
[null,null,11,"Sum of 95L_Limit",6.81,7.44,7.79,8.6999999999999993,9.66,10.67,11.35,12.43,13.55,14.29,15.48,15.76,17,18.3,19.079999999999998,19.87,20.67,22.08,23.55,23.73,25.24,26.09,26.94,28.56,29.44,30.32,31.21,32.1,33.869999999999997,34.78,35.700000000000003,36.630000000000003,38.53,39.479999999999997,40.43,41.39,42.35,43.31,45.4,45.24,47.38,48.38,49.38,50.39,51.39,52.4,54.74,55.78,56.82]
[null,{"$f":"C56","v":11},null,"Sum of MPN",12.23,13.36,14.49,15.63,16.77,17.91,19.05,20.2,21.35,22.51,23.66,24.82,25.99,27.15,28.32,29.5,30.67,31.85,33.03,34.22,35.409999999999997,36.6,37.799999999999997,38.99,40.200000000000003,41.4,42.61,43.82,45.04,46.26,47.48,48.71,49.94,51.17,52.41,53.65,54.89,56.14,57.39,58.64,59.9,61.16,62.43,63.7,64.97,66.25,67.53,68.81,70.099999999999994]
[{"$f":"C56","v":11},null,null,"Sum of 95U_Limit",21.4,22.31,23.57,25.27,26.83,28.17,29.33,30.69,32.299999999999997,33.75,35.04,36.11,37.67,39.090000000000003,40.15,41.64,42.71,44.2,45.68,46.79,47.97,49.54,51.02,52,53.68,54.59,56.19,57.41,58.86,60.08,61.3,62.6,64.2,65.42,66.569999999999993,67.790000000000006,69.16,70.69,72.209999999999994,73.430000000000007,74.5,75.88,77.55,78.55,79.989999999999995,81.37,82.97,83.73,85.26]
[null,null,12,"Sum of 95L_Limit",7.78,8.15,8.7899999999999991,9.43,10.43,11.47,12.56,13.7,14.88,15.65,15.93,17.190000000000001,17.96,19.3,20.100000000000001,21.5,22.33,23.16,24.67,24.83,26.39,27.26,28.89,29.78,30.68,31.58,32.479999999999997,33.380000000000003,35.200000000000003,36.14,37.07,38.01,39.96,40.93,41.9,42.88,43.85,44.83,46.98,47.99,49,50.02,51.04,52.06,53.09,54.12,56.51,57.58,58.64]
[null,{"$f":"C59","v":12},null,"Sum of MPN",13.5,14.64,15.79,16.940000000000001,18.100000000000001,19.260000000000002,20.420000000000002,21.58,22.75,23.92,25.09,26.27,27.45,28.64,29.82,31.01,32.21,33.409999999999997,34.61,35.81,37.020000000000003,38.229999999999997,39.450000000000003,40.67,41.89,43.11,44.34,45.58,46.81,48.05,49.3,50.55,51.8,53.05,54.31,55.58,56.84,58.11,59.39,60.67,61.95,63.23,64.52,65.819999999999993,67.12,68.42,69.72,71.03,72.349999999999994]
{"$rows_left_out":112}