{"text_format":"1","workbook":"xlsx","n_sheets":4,"sheets":["IDEXX MPN Generator","File Upload","Lists","Table"],"not_rendered":{"charts":0,"images":0,"macros":1,"external_links":0,"defined_names":0,"comments":0,"pivot_tables":1},"unopened":[],"bounds":{"document_bytes":16777216,"sheet_cells":100000,"rows_first":2000,"rows_last":500,"rows_between":2000,"halvings":0,"cell_chars":16384,"cell_head_chars":4096},"cells_cut":0,"cells_raw":0,"read":"whole","date_system":"1900"}

{"sheet":"IDEXX MPN Generator","index":0,"n_rows":5,"n_cols":17,"rows_kept":5,"cut":false,"hidden":false,"merged":[]}
["Instructions:  1) Copy data from Bacteria Record Sheet to the form below.  2) Calculate MPN. 3) Review Qualifier Codes"]
["4) Press Format Upload File Key.  5) Save File Upload worksheet as a .CSV in upload directory."]
["Lab ID","RID","Method","Collection Date/Time","Incubation Start Date/Time","Date of Analysis","Analyte Name","Start Temp","End Temp","Quanti-Tray/2000 Positive Large Wells","Quanti-Tray/2000 Positive Small Wells","MPN","Lower95 /Tray","Upper95 /Tray","Qualifier","Comments","Analyst"]
["SWQB Lab Unit",2468182,"Colilert/2000","2015-09-22T15:37:00","2015-09-22T15:30:00","2015-09-23T19:50:00","Total Coliform",35,35.1,49,48,{"$f":"IF(AND($J4=0,$K4=0),\"<1\",IF(AND($J4>=49,$K4>=48),\">2419.6\",VLOOKUP($J4,Table!$B$22:$BA$172,$K4+4)))","v":">2419.6"},{"$f":"IF(AND($J4=0,$K4=0),\"<1\",IF(AND($J4>=49,$K4>=48),\">1630.4\",VLOOKUP($J4,Table!$C$22:$BA$172,$K4+3)))","v":">1630.4"},{"$f":"IF(AND($J4=0,$K4=0),\"<1\",IF(AND($J4>=49,$K4>=48),\">4716.10\",VLOOKUP($J4,Table!$A$22:$BA$172,$K4+5)))","v":">4716.10"},{"$f":"CONCATENATE(IF(L4=\">2419.6\",\"E\",\"\"),IF(L4=\"<1\",\"U\",\"\"),,IF((E4-D4)>0.3334,\"I1\",\"\"),IF(OR(IF(C4=\"Colilert-182000\",(F4-E4)<0.75,(F4-E4)<1),IF(C4=\"Colilert-182000\",(F4-E4)>0.91667,(F4-E4)>1.16667)),\"Er\",\"\"),IF(OR(H4<34.5,I4<34.5),\"Er\",IF(OR(AND(H4>35.5,H4<38.1),AND(I4>35.5,I4<38.1)),\"Ea\",IF(OR(H4>38,I4>38),\"Er\",\"\"))))","v":"EEr"}]
["SWQB Lab Unit",2468182,"Colilert/2000","2015-09-22T15:37:00","2015-09-22T15:30:00","2015-09-23T19:50:00","Escherichia coli",35,35.1,37,7,{"$f":"IF(AND($J5=0,$K5=0),\"<1\",IF(AND($J5>=49,$K5>=48),\">2419.6\",VLOOKUP($J5,Table!$B$22:$BA$172,$K5+4)))","v":77.569999999999993},{"$f":"IF(AND($J5=0,$K5=0),\"<1\",IF(AND($J5>=49,$K5>=48),\">1630.4\",VLOOKUP($J5,Table!$C$22:$BA$172,$K5+3)))","v":55.3},{"$f":"IF(AND($J5=0,$K5=0),\"<1\",IF(AND($J5>=49,$K5>=48),\">4716.10\",VLOOKUP($J5,Table!$A$22:$BA$172,$K5+5)))","v":104.52},{"$f":"CONCATENATE(IF(L5=\">2419.6\",\"E\",\"\"),IF(L5=\"<1\",\"U\",\"\"),,IF((E5-D5)>0.3334,\"I1\",\"\"),IF(OR(IF(C5=\"Colilert-182000\",(F5-E5)<0.75,(F5-E5)<1),IF(C5=\"Colilert-182000\",(F5-E5)>0.91667,(F5-E5)>1.16667)),\"Er\",\"\"),IF(OR(H5<34.5,I5<34.5),\"Er\",IF(OR(AND(H5>35.5,H5<38.1),AND(I5>35.5,I5<38.1)),\"Ea\",IF(OR(H5>38,I5>38),\"Er\",\"\"))))","v":"Er"}]

{"sheet":"File Upload","index":1,"n_rows":3,"n_cols":16,"rows_kept":3,"cut":false,"hidden":false,"merged":[]}
["Lab ID","RID","Method","Date of Analysis","Analyte Name","Reported Value","Less Than","Greater Than","SDL","Qualifier Code","Comments","Units","MDL","PQL","Sample Fraction","Dilution Factor"]
["SWQB Lab Unit",2468182,"Colilert/2000","2015-09-23T19:50:00","Total Coliform",{"$f":"IF('IDEXX MPN Generator'!L4=\">2419.6\",\"2419.6\",IF('IDEXX MPN Generator'!L4=\"<1\",\"1\",'IDEXX MPN Generator'!L4))","v":"2419.6"},{"$f":"IF('IDEXX MPN Generator'!L4=\"<1\",\"TRUE\",\"FALSE\")","v":"FALSE"},{"$f":"IF('IDEXX MPN Generator'!L4=\">2419.6\",\"TRUE\",\"FALSE\")","v":"TRUE"},{"$f":"IF('IDEXX MPN Generator'!L4=\">2419.6\",\"2419.6\",\"1\")","v":"2419.6"},{"$f":"'IDEXX MPN Generator'!O4","v":"EEr"},{"$f":"CONCATENATE(\"Start Temp=\",'IDEXX MPN Generator'!H4,\";\",\"End Temp=\",'IDEXX MPN Generator'!I4,\";\",\"Large/Small=\",'IDEXX MPN Generator'!J4,\"/\",'IDEXX MPN Generator'!K4,\";\",\"95% CI Low/High=\",'IDEXX MPN Generator'!M4,\"/\",'IDEXX MPN Generator'!N4,\";\",'IDEXX MPN Generator'!P4)","v":"Start Temp=35;End Temp=35.1;Large/Small=49/48;95% CI Low/High=>1630.4/>4716.10;"},"MPN/100ml",1,1,"Total",1]
["SWQB Lab Unit",2468182,"Colilert/2000","2015-09-23T19:50:00","Escherichia coli",{"$f":"IF('IDEXX MPN Generator'!L5=\">2419.6\",\"2419.6\",IF('IDEXX MPN Generator'!L5=\"<1\",\"1\",'IDEXX MPN Generator'!L5))","v":77.569999999999993},{"$f":"IF('IDEXX MPN Generator'!L5=\"<1\",\"TRUE\",\"FALSE\")","v":"FALSE"},{"$f":"IF('IDEXX MPN Generator'!L5=\">2419.6\",\"TRUE\",\"FALSE\")","v":"FALSE"},{"$f":"IF('IDEXX MPN Generator'!L5=\">2419.6\",\"2419.6\",\"1\")","v":"1"},{"$f":"'IDEXX MPN Generator'!O5","v":"Er"},{"$f":"CONCATENATE(\"Start Temp=\",'IDEXX MPN Generator'!H5,\";\",\"End Temp=\",'IDEXX MPN Generator'!I5,\";\",\"Large/Small=\",'IDEXX MPN Generator'!J5,\"/\",'IDEXX MPN Generator'!K5,\";\",\"95% CI Low/High=\",'IDEXX MPN Generator'!M5,\"/\",'IDEXX MPN Generator'!N5,\";\",'IDEXX MPN Generator'!P5)","v":"Start Temp=35;End Temp=35.1;Large/Small=37/7;95% CI Low/High=55.3/104.52;"},"MPN/100ml",1,1,"Total",1]

{"sheet":"Lists","index":2,"n_rows":6,"n_cols":7,"rows_kept":6,"cut":false,"hidden":false,"merged":[]}
["Lab ID","Method",null,"Analysis",null,"Qualifiers"]
["SWQB Field","Colilert-182000",null,"Total Coliform",null,"E","Analyte value exceeds calibration range"]
["SWQB Lab Unit","Colilert/2000",null,"Escherichia coli",null,"U","Result below method detection limit"]
["SLD",null,null,null,null,"I1","Estimated-sample collection time to incubation start exceeds eight hours"]
["Other",null,null,null,null,"Ea","Estimated-Incubation temperature between 35.5 and 38.0° Celsius  "]
[null,null,null,null,null,"Er","Rejected-Incubation temperature < 34.5 or >38.0° Celsius: or, incubation period shorter or 4 hours greater than prescribed in method."]

{"sheet":"Table","index":3,"n_rows":172,"n_cols":53,"rows_kept":172,"cut":false,"hidden":false,"merged":[]}
[null,null,null,"MPN and 95% Conf. Int. Calculator"]
[null,null,null,"for IDEXX Colilert Quanti-Tray 2000"]
[]
["This pivot table- lookup was developed by David Thoma, National Park Service Inventory and Monitoring"]
["The values in the table are from IDEXX laboratories for the Quanti-Tray 2000 system"]
[]
["1 IDEXX Drive",null,"Mention of trade names or commercial products does not constitute endorsement or recommendation for use by the National Park Service."]
["Westbrook Maine 04092",null,"NPS makes no warrantee as to the reliability of this application or its suitability for the end users purpose."]
["United States"]
["Telephone:  1-800-321-0207",null,null,"big wells (+)","sm. wells (+)"]
["Fax:  207-856-0630",null,"Tot. Coli",1,1,"enter well counts more yellow than comparator in blue cells"]
["water@idexx.com",null,"E. Coli",1,1,"enter flourescent well counts in yellow cells"]
["www.idexx.com"]
[]
[null,null,"95L","MPN","95H"]
["Tot. Coli (MPN/100mL)",null,{"$f":"IF(AND(D11=0,E11=0),\"<1\",IF(AND(D11>=49,E11>=48),\">1630.4\",VLOOKUP(D11,C22:BA172,E11+3)))","v":0.25},{"$f":"IF(AND(D11=0,E11=0),\"<1\",IF(AND(D11>=49,E11>=48),\">2419.6\",VLOOKUP(D11,B22:BA172,E11+4)))","v":2.0099999999999998},{"$f":"IF(AND(D11>=49,E11>=48),\">4716.1\",VLOOKUP(D11,A22:BA172,E11+5))","v":5.92},"results from look up table for Tot. Coli"]
["E. Coli (MPN/100mL)",null,{"$f":"IF(AND(D12=0,E12=0),\"<1\",IF(AND(D11>=49,E11>=48),\">1630.4\",VLOOKUP(D12,C22:BA172,E11+3)))","v":0.25},{"$f":"IF(AND(D12=0,E12=0),\"<1\",IF(AND(D12>=49,E12>=48),\">2419.6\",VLOOKUP(D12,B22:BA172,E12+4)))","v":2.0099999999999998},{"$f":"IF(AND(D12>=49,E12>=48),\"4716.1\",VLOOKUP(D12,A22:BA172,E12+5))","v":5.92},"results from look up table for E. Coli"]
[null,null,null,null,null,"MPN is the most probable number"]
[null,null,null,null,null,"95L and 95H refer to the 95% lower and upper confidence interval bounds "]
[]
[null,null,null,null,"SWells"]
["Lwells","Lwells","LWells","Data",0,1,2,3,4,5,6,7,8,9,10,11,12,13,14,15,16,17,18,19,20,21,22,23,24,25,26,27,28,29,30,31,32,33,34,35,36,37,38,39,40,41,42,43,44,45,46,47,48]
[null,null,0,"Sum of 95L_Limit",0,0.03,0.25,0.61,1.1299999999999999,1.7,2.2799999999999998,2.93,3.67,4.4800000000000004,5.18,5.91,6.93,7.76,8.64,8.9700000000000006,9.58,10.52,11.5,12.53,13.2,13.87,14.54,15.67,16.36,17.55,18.27,19.52,19.71,21,21.74,22.49,23.87,24.63,25.4,26.17,27.66,28.45,29.24,30.04,30.84,31.63,33.270000000000003,34.090000000000003,34.92,35.74,37.49,38.340000000000003,39.19]
[null,{"$f":"C23","v":0},null,"Sum of MPN",0,0.99,1.99,2.98,3.98,4.9800000000000004,5.98,6.98,7.99,8.99,10,11.01,12.02,13.03,14.05,15.06,16.079999999999998,17.100000000000001,18.12,19.14,20.170000000000002,21.19,22.22,23.25,24.28,25.31,26.35,27.38,28.42,29.46,30.5,31.54,32.590000000000003,33.630000000000003,34.68,35.729999999999997,36.78,37.840000000000003,38.89,39.950000000000003,41.01,42.07,43.13,44.19,45.26,46.33,47.4,48.47,49.54]
[{"$f":"C23","v":0},null,null,"Sum of 95U_Limit",3.67,3.67,5.59,7.3,8.94,10.54,12.12,13.71,15.28,15.78,16.93,18.48,20.100000000000001,21.17,21.85,23.44,24.93,25.71,26.89,28.56,29.32,30.47,31.84,33.1,34.17,35.200000000000003,36.450000000000003,37.67,38.590000000000003,39.89,41.18,42.25,43.43,44.43,45.68,46.79,47.97,49.04,50.32,51.16,52.84,53.68,54.74,56.12,57.11,58.1,59.47,60.69,61.61]
[null,null,1,"Sum of 95L_Limit",0.05,0.25,0.62,1.1399999999999999,1.72,2.2999999999999998,2.96,3.7,4.34,5.22,5.97,6.75,7.58,8.7200000000000006,9.35,9.67,10.62,11.61,12.64,13.32,14,14.68,15.82,17,17.22,18.440000000000001,19.170000000000002,20.46,21.21,21.96,22.71,23.46,24.88,25.66,26.43,27.94,28.74,29.54,30.35,31.15,32.79,33.619999999999997,34.450000000000003,35.28,36.119999999999997,36.950000000000003,38.74,39.6,40.46]
[null,{"$f":"C26","v":1},null,"Sum of MPN",1,2.0099999999999998,3.01,4.0199999999999996,5.03,6.04,7.05,8.06,9.08,10.09,11.11,12.13,13.15,14.18,15.2,16.23,17.260000000000002,18.29,19.32,20.36,21.39,22.43,23.47,24.51,25.56,26.6,27.65,28.7,29.75,30.8,31.86,32.909999999999997,33.97,35.03,36.090000000000003,37.159999999999997,38.22,39.29,40.36,41.43,42.5,43.58,44.65,45.73,46.81,47.9,48.98,50.07,51.16]
[{"$f":"C26","v":1},null,null,"Sum of 95U_Limit",5.49,5.92,7.33,8.94,10.54,12.12,13.71,15.28,16.16,17.16,18.48,20.100000000000001,21.74,22.22,23.55,25.1,26.37,27.04,28.63,29.97,30.69,32.299999999999997,33.14,34.47,35.69,37.06,38.090000000000003,39.159999999999997,40.57,41.64,42.71,43.97,44.92,46.37,47.21,48.77,49.56,51.01,52,53.07,54.51,55.35,56.57,57.95,58.86,60.08,61.3,62.52,63.59]
[null,null,2,"Sum of 95L_Limit",0.26,0.68,1.1499999999999999,1.63,2.3199999999999998,2.99,3.73,4.38,5.27,6.02,6.82,7.65,8.52,9.44,9.76,10.38,11.36,12.38,13.45,14.13,14.82,15.97,17.16,17.89,18.100000000000001,19.36,20.66,21.42,22.18,23.57,24.35,25.13,25.92,26.7,28.23,29.04,29.85,30.66,31.48,32.29,33.97,34.81,35.659999999999997,36.5,37.35,38.19,40.03,40.9,41.78]
[null,{"$f":"C29","v":2},null,"Sum of MPN",2.02,3.04,4.05,5.07,6.09,7.11,8.1300000000000008,9.16,10.19,11.21,12.24,13.28,14.31,15.35,16.38,17.420000000000002,18.46,19.510000000000002,20.55,21.6,22.65,23.7,24.75,25.81,26.86,27.92,28.98,30.04,31.11,32.18,33.24,34.31,35.39,36.46,37.54,38.61,39.69,40.78,41.86,42.95,44.03,45.12,46.22,47.31,48.41,49.51,50.61,51.71,52.81]
[{"$f":"C29","v":2},null,null,"Sum of 95U_Limit",7.13,7.37,8.9499999999999993,10.55,12.12,13.71,15.28,16.87,17.809999999999999,18.559999999999999,20.12,21.74,22.88,23.95,25.14,26.81,27.5,28.83,30.35,31.19,32.56,33.75,35.04,36.11,37.1,38.479999999999997,39.700000000000003,40.57,42.02,43.36,44.35,45.68,46.64,47.97,48.93,50.32,51.16,52.84,53.68,54.9,56.19,57.11,58.56,59.7,60.77,61.84,62.98,64.2,65.42]
[null,null,3,"Sum of 95L_Limit",0.69,1.1599999999999999,1.65,2.34,3.01,3.61,4.42,5.12,6.08,6.88,7.72,8.61,9.5299999999999994,10.18,10.48,11.47,12.5,13.58,14.27,14.96,15.66,16.84,18.07,18.809999999999999,19.55,20.87,21.63,22.4,23.17,24.6,25.39,26.18,26.98,27.78,29.34,30.16,30.98,31.81,32.64,34.33,35.18,36.04,36.89,37.75,38.61,40.47,41.35,42.24,43.12]
[null,{"$f":"C32","v":3},null,"Sum of MPN",3.06,4.09,5.12,6.15,7.18,8.2100000000000009,9.24,10.28,11.32,12.36,13.4,14.45,15.49,16.54,17.59,18.64,19.7,20.75,21.81,22.87,23.93,25,26.06,27.13,28.2,29.27,30.35,31.42,32.5,33.58,34.659999999999997,35.75,36.840000000000003,37.93,39.020000000000003,40.11,41.2,42.3,43.4,44.5,45.61,46.71,47.82,48.93,50.04,51.16,52.28,53.39,54.52]
[{"$f":"C32","v":3},null,null,"Sum of 95U_Limit",8.94,9.07,10.55,12.14,13.71,15.29,16.87,18.29,18.84,20.2,21.76,23.4,24.05,25.29,26.87,28.15,29.17,30.43,31.84,32.68,34.17,35.200000000000003,36.450000000000003,37.67,39.090000000000003,40.15,41.26,42.71,43.62,44.92,46.18,47.21,48.58,49.54,51.01,52,53.22,54.51,55.35,56.96,57.95,59.02,60.16,61.53,62.6,63.75,64.97,66.11,67.33]
[null,null,4,"Sum of 95L_Limit",1.65,1.76,2.36,2.9,3.64,4.46,5.17,5.91,6.94,7.79,8.69,9.6199999999999992,10.27,10.93,11.58,12.62,13.71,14.84,15.11,15.81,17.010000000000002,18.25,19,19.75,20.5,21.85,22.63,23.41,24.85,25.65,26.46,27.26,28.07,29.65,30.48,31.31,32.15,32.99,34.700000000000003,35.57,36.43,37.299999999999997,38.159999999999997,40.020000000000003,40.92,41.81,42.71,43.61,44.51]
[null,{"$f":"C35","v":4},null,"Sum of MPN",4.13,5.16,6.2,7.24,8.2899999999999991,9.33,10.38,11.42,12.48,13.53,14.58,15.64,16.7,17.760000000000002,18.82,19.89,20.96,22.02,23.1,24.17,25.25,26.32,27.4,28.49,29.57,30.66,31.75,32.840000000000003,33.93,35.020000000000003,36.119999999999997,37.22,38.32,39.43,40.53,41.64,42.75,43.87,44.98,46.1,47.22,48.34,49.47,50.6,51.72,52.86,53.99,55.13,56.27]
[{"$f":"C35","v":4},null,null,"Sum of 95U_Limit",9.52,10.76,12.24,13.73,15.29,16.87,18.48,19.489999999999998,20.52,21.76,23.4,24.62,25.71,26.89,28.57,29.32,30.69,32.18,33.1,34.47,35.69,37.06,38.090000000000003,39.24,40.57,41.79,42.75,44.2,45.57,46.45,47.97,48.81,50.32,51.16,52.84,53.68,55.2,56.19,57.41,58.63,59.78,60.92,62.45,63.52,64.739999999999995,65.959999999999994,67.25,68.400000000000006,69.39]
[null,null,5,"Sum of 95L_Limit",2.29,2.5099999999999998,2.93,3.67,4.32,5.22,5.97,6.76,7.6,8.48,9.41,10.37,11.03,11.69,12.36,13.43,14.55,15.72,15.97,17.18,17.920000000000002,19.190000000000001,19.95,20.71,22.08,22.87,23.65,24.44,25.92,26.74,27.55,28.37,29.19,30.81,31.65,32.5,33.35,35.08,35.96,36.83,37.71,38.590000000000003,39.47,41.37,42.28,43.19,44.1,45.02,45.93]
[null,{"$f":"C38","v":5},null,"Sum of MPN",5.21,6.26,7.31,8.36,9.42,10.47,11.53,12.59,13.66,14.72,15.79,16.86,17.93,19.010000000000002,20.079999999999998,21.16,22.24,23.33,24.41,25.5,26.59,27.68,28.78,29.87,30.97,32.07,33.18,34.28,35.39,36.5,37.619999999999997,38.729999999999997,39.85,40.97,42.09,43.22,44.35,45.47,46.61,47.74,48.88,50.02,51.16,52.31,53.45,54.6,55.75,56.91,58.07]
[{"$f":"C38","v":5},null,null,"Sum of 95U_Limit",11.94,12.73,13.89,15.29,16.88,18.48,20.100000000000001,21.17,21.85,23.44,25.1,26.37,27.04,28.63,29.97,31.19,32.299999999999997,33.75,35.04,36.11,37.520000000000003,38.479999999999997,39.89,41.18,42.25,43.43,44.88,45.84,47.21,48.47,49.54,51.01,52,53.29,54.51,55.66,57.03,58.02,59.32,60.69,61.84,62.98,64.2,65.42,66.569999999999993,67.790000000000006,69.010000000000005,70.38,71.680000000000007]
[null,null,6,"Sum of 95L_Limit",2.9,3.24,3.71,4.3600000000000003,5.27,6.03,6.83,7.68,8.57,9.5,10.48,11.14,11.81,12.48,13.57,14.7,15.88,16.62,17.36,18.100000000000001,19.39,20.16,20.93,22.31,23.11,23.9,24.7,26.2,27.02,27.85,28.67,29.5,31.14,32,32.85,33.71,35.47,36.36,37.24,38.130000000000003,39.020000000000003,39.92,40.81,42.77,43.69,44.61,45.54,46.47,47.4]
[null,{"$f":"C41","v":6},null,"Sum of MPN",6.32,7.38,8.44,9.51,10.57,11.64,12.72,13.79,14.87,15.95,17.03,18.11,19.2,20.28,21.37,22.47,23.56,24.66,25.76,26.86,27.97,29.07,30.18,31.3,32.409999999999997,33.53,34.65,35.770000000000003,36.89,38.020000000000003,39.15,40.28,41.42,42.55,43.69,44.83,45.98,47.13,48.28,49.43,50.58,51.74,52.9,54.07,55.23,56.4,57.57,58.74,59.92]
[{"$f":"C41","v":6},null,null,"Sum of 95U_Limit",13.71,14.4,15.34,16.93,18.48,20.100000000000001,21.74,22.22,23.55,25.14,26.81,27.5,28.83,30.43,31.84,32.56,34.17,35.200000000000003,36.450000000000003,37.83,39.090000000000003,40.15,41.64,42.71,44.2,45.19,46.45,47.94,48.77,50.34,51.16,52.84,53.75,55.35,56.19,57.57,58.86,60.08,61.3,62.52,63.59,64.81,66.11,67.48,68.7,69.77,70.989999999999995,72.44,73.66]
[null,null,7,"Sum of 95L_Limit",3.56,3.91,4.41,5.1100000000000003,6.09,6.9,7.75,8.65,9.59,10.58,11.61,12.31,12.61,13.71,14.85,15.57,16.79,17.54,18.29,19.59,20.37,21.15,21.93,23.35,24.16,24.96,26.48,27.31,28.15,28.99,30.62,31.49,32.35,33.22,34.090000000000003,34.96,36.770000000000003,37.67,38.57,39.47,40.380000000000003,41.29,43.26,44.2,45.14,46.08,47.02,47.96,48.91]
[null,{"$f":"C44","v":7},null,"Sum of MPN",7.45,8.52,9.6,10.68,11.76,12.84,13.93,15.01,16.100000000000001,17.2,18.29,19.39,20.49,21.59,22.7,23.8,24.91,26.03,27.14,28.26,29.38,30.5,31.63,32.76,33.89,35.020000000000003,36.15,37.29,38.43,39.58,40.72,41.87,43.03,44.18,45.34,46.5,47.66,48.83,49.99,51.16,52.34,53.51,54.69,55.88,57.06,58.25,59.44,60.63,61.83]
[{"$f":"C44","v":7},null,null,"Sum of 95U_Limit",14.87,15.64,16.93,18.54,20.12,21.74,22.88,23.95,25.29,26.87,28.15,29.32,30.47,31.92,33.1,34.47,35.69,37.06,38.130000000000003,39.700000000000003,40.57,42.02,43.36,44.43,45.68,47.21,48.32,49.54,51.01,52,53.45,54.51,55.89,57.11,58.25,59.7,60.77,61.91,63.44,64.66,65.959999999999994,67.25,68.48,69.7,70.84,72.209999999999994,73.430000000000007,74.349999999999994,75.88]
[null,null,8,"Sum of 95L_Limit",4.45,4.45,5.16,5.91,6.71,7.83,8.74,9.69,10.35,11.37,12.43,13.14,13.85,14.56,15.74,16.96,17.72,18.48,19.239999999999998,20.59,21.37,22.16,23.6,24.42,25.24,26.06,27.61,28.46,29.31,30.16,31.84,32.72,33.6,34.479999999999997,35.36,36.25,38.1,39.020000000000003,39.93,40.85,41.77,43.77,44.72,45.67,46.63,47.58,48.54,49.5,50.47]
[null,{"$f":"C47","v":8},null,"Sum of MPN",8.6,9.69,10.78,11.87,12.97,14.06,15.16,16.260000000000002,17.37,18.48,19.59,20.7,21.81,22.93,24.05,25.17,26.3,27.43,28.56,29.69,30.83,31.97,33.11,34.25,35.4,36.549999999999997,37.700000000000003,38.86,40.020000000000003,41.18,42.34,43.51,44.68,45.85,47.03,48.21,49.39,50.57,51.76,52.95,54.14,55.34,56.54,57.74,58.95,60.16,61.37,62.58,63.8]
[{"$f":"C47","v":8},null,null,"Sum of 95U_Limit",16.87,17.16,18.61,20.16,21.76,23.4,24.62,25.71,26.89,28.57,29.97,30.69,32.299999999999997,33.75,35.04,36.11,37.67,38.479999999999997,40.15,41.26,42.71,43.97,44.92,46.45,47.82,48.77,50.34,51.16,52.84,53.75,55.35,56.35,57.95,59.02,60.16,61.61,62.98,64.2,65.42,66.569999999999993,67.790000000000006,69.09,70.38,71.680000000000007,72.98,74.27,75.650000000000006,77.02,77.86]
[null,null,9,"Sum of 95L_Limit",4.68,5.63,5.97,6.78,7.63,8.52,9.4700000000000006,10.45,11.48,12.56,13.27,13.99,14.71,15.9,17.14,17.91,18.68,19.45,20.81,21.61,22.4,23.21,24.69,25.51,26.34,27.92,28.78,29.64,30.5,32.200000000000003,33.090000000000003,33.979999999999997,34.880000000000003,35.770000000000003,36.67,38.549999999999997,39.47,40.4,41.34,42.27,44.3,45.26,46.23,47.2,48.17,49.14,51.35,51.09,53.36]
[null,{"$f":"C50","v":9},null,"Sum of MPN",9.7899999999999991,10.89,11.99,13.1,14.2,15.31,16.43,17.55,18.66,19.79,20.91,22.04,23.17,24.3,25.44,26.58,27.72,28.86,30.01,31.16,32.31,33.47,34.630000000000003,35.79,36.950000000000003,38.119999999999997,39.29,40.47,41.64,42.82,44.01,45.19,46.38,47.57,48.77,49.97,51.17,52.37,53.58,54.79,56,57.22,58.44,59.66,60.89,62.12,63.35,64.59,65.83]
[{"$f":"C50","v":9},null,null,"Sum of 95U_Limit",18.36,19.489999999999998,20.27,21.76,23.44,25.1,26.37,27.04,28.63,30.35,31.19,32.56,34.17,35.200000000000003,36.450000000000003,38.090000000000003,39.159999999999997,40.57,41.79,43.24,44.35,45.68,47.17,47.97,49.54,51.02,52,53.68,54.51,56.12,57.11,58.56,59.78,61.15,62.52,63.59,64.739999999999995,66.11,67.48,69.010000000000005,70.31,71.45,72.52,74.040000000000006,75.42,76.41,77.78,79.31,80.599999999999994]
[null,null,10,"Sum of 95L_Limit",5.69,6.5,7.1,7.71,8.61,9.56,10.56,11.6,12.69,13.41,14.14,14.86,16.07,16.82,18.100000000000001,18.88,19.66,21.03,21.84,23.29,23.46,24.96,25.8,26.64,28.24,29.11,29.98,30.85,31.73,33.47,34.380000000000003,35.28,36.19,37.1,39.01,39.950000000000003,40.89,41.83,42.78,43.73,45.82,46.8,47.78,48.77,49.75,50.74,53.02,54.04,55.06]
[null,{"$f":"C53","v":10},null,"Sum of MPN",11,12.11,13.23,14.35,15.47,16.600000000000001,17.73,18.86,19.989999999999998,21.13,22.27,23.41,24.56,25.71,26.86,28.02,29.18,30.34,31.5,32.67,33.840000000000003,35.01,36.19,37.369999999999997,38.549999999999997,39.74,40.93,42.12,43.32,44.52,45.72,46.92,48.13,49.34,50.56,51.78,53,54.23,55.45,56.69,57.92,59.16,60.4,61.65,62.9,64.150000000000006,65.41,66.67,67.930000000000007]
[{"$f":"C53","v":10},null,null,"Sum of 95U_Limit",20.079999999999998,21.09,22.01,23.55,25.1,26.81,27.5,28.83,30.43,31.84,33.1,34.47,35.69,37.06,38.479999999999997,39.700000000000003,41.18,42.25,43.43,44.92,46.45,47.48,48.77,50.34,51.16,52.84,54.13,55.35,56.8,57.95,59.09,60.69,61.84,62.98,64.510000000000005,65.959999999999994,67.25,68.48,69.7,70.989999999999995,72.290000000000006,73.66,75.040000000000006,76.260000000000005,77.63,79.23,79.989999999999995,81.37,83.2]
[null,null,11,"Sum of 95L_Limit",6.81,7.44,7.79,8.6999999999999993,9.66,10.67,11.35,12.43,13.55,14.29,15.48,15.76,17,18.3,19.079999999999998,19.87,20.67,22.08,23.55,23.73,25.24,26.09,26.94,28.56,29.44,30.32,31.21,32.1,33.869999999999997,34.78,35.700000000000003,36.630000000000003,38.53,39.479999999999997,40.43,41.39,42.35,43.31,45.4,45.24,47.38,48.38,49.38,50.39,51.39,52.4,54.74,55.78,56.82]
[null,{"$f":"C56","v":11},null,"Sum of MPN",12.23,13.36,14.49,15.63,16.77,17.91,19.05,20.2,21.35,22.51,23.66,24.82,25.99,27.15,28.32,29.5,30.67,31.85,33.03,34.22,35.409999999999997,36.6,37.799999999999997,38.99,40.200000000000003,41.4,42.61,43.82,45.04,46.26,47.48,48.71,49.94,51.17,52.41,53.65,54.89,56.14,57.39,58.64,59.9,61.16,62.43,63.7,64.97,66.25,67.53,68.81,70.099999999999994]
[{"$f":"C56","v":11},null,null,"Sum of 95U_Limit",21.4,22.31,23.57,25.27,26.83,28.17,29.33,30.69,32.299999999999997,33.75,35.04,36.11,37.67,39.090000000000003,40.15,41.64,42.71,44.2,45.68,46.79,47.97,49.54,51.02,52,53.68,54.59,56.19,57.41,58.86,60.08,61.3,62.6,64.2,65.42,66.569999999999993,67.790000000000006,69.16,70.69,72.209999999999994,73.430000000000007,74.5,75.88,77.55,78.55,79.989999999999995,81.37,82.97,83.73,85.26]
[null,null,12,"Sum of 95L_Limit",7.78,8.15,8.7899999999999991,9.43,10.43,11.47,12.56,13.7,14.88,15.65,15.93,17.190000000000001,17.96,19.3,20.100000000000001,21.5,22.33,23.16,24.67,24.83,26.39,27.26,28.89,29.78,30.68,31.58,32.479999999999997,33.380000000000003,35.200000000000003,36.14,37.07,38.01,39.96,40.93,41.9,42.88,43.85,44.83,46.98,47.99,49,50.02,51.04,52.06,53.09,54.12,56.51,57.58,58.64]
[null,{"$f":"C59","v":12},null,"Sum of MPN",13.5,14.64,15.79,16.940000000000001,18.100000000000001,19.260000000000002,20.420000000000002,21.58,22.75,23.92,25.09,26.27,27.45,28.64,29.82,31.01,32.21,33.409999999999997,34.61,35.81,37.020000000000003,38.229999999999997,39.450000000000003,40.67,41.89,43.11,44.34,45.58,46.81,48.05,49.3,50.55,51.8,53.05,54.31,55.58,56.84,58.11,59.39,60.67,61.95,63.23,64.52,65.819999999999993,67.12,68.42,69.72,71.03,72.349999999999994]
[{"$f":"C59","v":12},null,null,"Sum of 95U_Limit",23.4,24.62,25.71,27.04,28.63,29.97,31.19,32.56,34.17,35.200000000000003,36.450000000000003,38.090000000000003,39.24,40.57,42.02,43.43,44.88,46.18,47.21,48.77,50.34,51.16,52.84,54.36,55.35,56.96,58.02,59.7,60.77,62.45,63.59,64.739999999999995,66.11,67.709999999999994,69.010000000000005,70.38,71.680000000000007,72.98,74.349999999999994,75.8,77.17,78.55,79.540000000000006,81.37,82.66,83.73,85.26,86.94,87.7]
[null,null,13,"Sum of 95L_Limit",8.5299999999999994,9.19,9.8699999999999992,10.54,11.59,12.7,13.42,14.6,15.82,16.600000000000001,17.38,18.16,19.510000000000002,20.32,21.75,22.59,23.43,24.96,25.83,26.7,27.58,28.45,30.14,31.05,31.96,32.869999999999997,34.69,35.630000000000003,36.58,37.53,38.479999999999997,39.44,41.44,42.43,43.42,44.41,45.41,46.41,48.61,49.64,50.68,51.71,52.75,53.8,54.85,55.9,58.36,59.44,60.53]
[null,{"$f":"C62","v":13},null,"Sum of MPN",14.8,15.96,17.12,18.29,19.46,20.64,21.81,23,24.18,25.37,26.56,27.76,28.96,30.16,31.37,32.58,33.79,35.01,36.229999999999997,37.450000000000003,38.68,39.909999999999997,41.15,42.39,43.63,44.88,46.13,47.39,48.64,49.91,51.17,52.45,53.72,55,56.28,57.57,58.86,60.15,61.45,62.76,64.06,65.38,66.69,68.010000000000005,69.34,70.66,72,73.33,74.680000000000007]
[{"$f":"C62","v":13},null,null,"Sum of 95U_Limit",25.06,26.37,27.39,28.82,30.43,31.84,33.1,34.47,35.69,37.06,38.479999999999997,39.89,41.26,42.71,44.2,45.57,46.64,47.97,49.54,51.02,52,53.68,54.74,56.19,57.57,58.86,60.16,61.61,62.98,64.36,65.959999999999994,67.25,68.48,69.7,70.989999999999995,72.44,74.040000000000006,75.650000000000006,76.87,77.86,79.459999999999994,81.22,82.28,83.35,85.26,86.71,87.39,89.45,90.83]
[null,null,14,"Sum of 95L_Limit",9.2899999999999991,10.31,11.01,11.72,12.43,13.57,14.76,16,16.78,17.57,18.37,19.73,20.55,22,22.85,23.7,24.56,26.13,27.02,27.9,28.79,30.5,31.42,32.35,33.270000000000003,35.119999999999997,36.07,37.03,38,38.97,40.97,41.97,42.98,43.98,44.99,46,47.02,49.25,50.3,51.35,52.41,53.47,54.53,55.6,56.67,59.16,60.27,61.37,62.49]
[null,{"$f":"C65","v":14},null,"Sum of MPN",16.13,17.309999999999999,18.489999999999998,19.670000000000002,20.86,22.05,23.25,24.45,25.65,26.86,28.07,29.29,30.5,31.73,32.950000000000003,34.18,35.42,36.65,37.9,39.14,40.39,41.64,42.9,44.16,45.43,46.7,47.97,49.25,50.53,51.82,53.11,54.41,55.7,57.01,58.32,59.63,60.94,62.27,63.59,64.92,66.25,67.59,68.94,70.28,71.64,72.989999999999995,74.349999999999994,75.72,77.09]
[{"$f":"C65","v":14},null,null,"Sum of 95U_Limit",26.81,28.15,29.22,30.69,32.299999999999997,33.71,35.04,36.11,37.67,39.090000000000003,40.57,41.79,43.36,44.43,45.84,47.21,48.77,50.34,51.18,52.84,54.51,55.35,57.11,58.56,59.78,61.3,62.52,63.97,65.42,66.569999999999993,67.94,69.62,70.92,72.290000000000006,73.66,75.040000000000006,76.41,77.78,79.459999999999994,80.760000000000005,82.05,83.27,85.26,86.25,87.39,89.45,90.67,91.59,93.84]
[null,null,15,"Sum of 95L_Limit",10.08,10.77,11.85,12.56,13.72,14.92,15.69,16.97,17.77,18.579999999999998,19.38,20.79,21.63,23.12,23.98,24.85,26.44,27.34,28.24,29.14,30.87,31.81,32.75,33.69,35.56,36.53,37.5,38.479999999999997,39.47,40.450000000000003,41.44,43.54,44.56,45.58,46.61,47.65,48.68,50.98,52.05,53.13,54.2,55.29,56.37,58.88,60,61.12,62.25,63.38,64.52]
[null,{"$f":"C68","v":15},null,"Sum of MPN",17.489999999999998,18.690000000000001,19.89,21.09,22.3,23.51,24.72,25.94,27.17,28.39,29.62,30.86,32.1,33.340000000000003,34.590000000000003,35.840000000000003,37.090000000000003,38.35,39.61,40.880000000000003,42.15,43.43,44.71,45.99,47.28,48.58,49.88,51.18,52.48,53.8,55.11,56.43,57.76,59.09,60.42,61.76,63.1,64.45,65.8,67.16,68.52,69.89,71.260000000000005,72.64,74.02,75.41,76.8,78.2,79.599999999999994]
[{"$f":"C68","v":15},null,null,"Sum of 95U_Limit",28.55,29.98,30.89,32.56,34.130000000000003,35.200000000000003,36.450000000000003,38.090000000000003,39.700000000000003,41.18,42.25,43.97,44.92,46.45,47.97,49.54,51.02,52,53.68,55.2,56.19,57.95,59.02,60.69,61.84,63.52,64.739999999999995,66.11,67.790000000000006,69.010000000000005,70.38,71.98,73.430000000000007,74.73,75.88,77.63,79.23,80.599999999999994,81.52,83.27,85.11,86.17,87.32,89.45,90.45,91.59,93.84,94.6,96.13]
[null,null,16,"Sum of 95L_Limit",11.26,12.37,12.71,13.87,14.63,15.87,17.170000000000002,17.98,18.79,19.61,21.04,21.88,23.39,24.27,25.15,26.76,27.67,28.59,29.5,30.42,32.21,33.159999999999997,34.11,35.07,37,37.99,38.979999999999997,39.979999999999997,40.98,43.08,44.12,45.16,46.2,47.25,48.3,49.35,50.41,52.77,53.87,54.97,56.07,57.17,58.28,60.86,62.01,63.16,64.31,65.47,66.63]
[null,{"$f":"C71","v":16},null,"Sum of MPN",18.899999999999999,20.11,21.33,22.55,23.78,25.01,26.24,27.48,28.72,29.97,31.22,32.479999999999997,33.74,35,36.270000000000003,37.54,38.82,40.1,41.39,42.68,43.97,45.27,46.58,47.89,49.2,50.52,51.84,53.17,54.5,55.84,57.18,58.53,59.88,61.24,62.6,63.97,65.34,66.72,68.099999999999994,69.489999999999995,70.88,72.28,73.680000000000007,75.09,76.5,77.92,79.34,80.77,82.21]
[{"$f":"C71","v":16},null,null,"Sum of 95U_Limit",30.36,31.84,32.6,34.47,35.770000000000003,37.1,38.479999999999997,40.15,41.64,42.71,44.35,45.68,47.21,48.77,50.34,51.18,52.84,54.51,55.89,57.11,58.63,60.08,61.53,62.98,64.2,65.959999999999994,67.25,68.48,70.31,71.680000000000007,72.98,74.349999999999994,75.88,77.55,78.849999999999994,79.989999999999995,81.37,83.27,84.8,85.87,87.32,89.45,90.29,91.59,93.84,94.6,96.13,98.42,98.88]
[null,null,17,"Sum of 95L_Limit",12.11,12.85,14.03,14.8,16.059999999999999,16.850000000000001,18.190000000000001,19.010000000000002,20.43,21.29,22.15,23.67,24.56,25.45,26.35,28.02,28.94,29.87,30.81,32.619999999999997,33.58,34.549999999999997,35.53,37.479999999999997,38.49,39.5,40.51,41.53,42.55,44.71,45.77,46.83,47.9,48.97,51.31,51.12,53.52,54.64,55.75,56.88,58,59.13,60.27,62.93,64.099999999999994,65.28,66.459999999999994,67.650000000000006,68.84]
[null,{"$f":"C74","v":17},null,"Sum of MPN",20.34,21.57,22.81,24.05,25.3,26.55,27.8,29.06,30.32,31.59,32.869999999999997,34.14,35.43,36.71,38,39.299999999999997,40.6,41.91,43.22,44.53,45.85,47.18,48.51,49.84,51.18,52.53,53.88,55.23,56.59,57.96,59.33,60.7,62.09,63.47,64.86,66.260000000000005,67.66,69.069999999999993,70.48,71.900000000000006,73.33,74.760000000000005,76.19,77.63,79.08,80.53,81.99,83.46,84.93]
[{"$f":"C74","v":17},null,null,"Sum of 95U_Limit",32.18,33.71,35.04,36.450000000000003,37.67,39.159999999999997,40.57,42.02,43.43,44.92,46.45,47.97,49.54,51.02,51.98,53.68,55.35,56.35,57.95,59.7,60.77,62.52,63.59,65.42,66.569999999999993,68.400000000000006,69.7,70.989999999999995,72.44,74.040000000000006,75.650000000000006,77.17,78.55,79.77,81.37,83.27,84.57,85.41,87.32,89.38,90.29,91.59,93.88,94.6,96.13,98.57,99.03,101.01,102.54]
[null,null,18,"Sum of 95L_Limit",13.42,14.19,15.44,15.74,17.05,18.41,19.239999999999998,20.68,21.55,22.42,23.29,24.87,25.77,26.68,27.59,29.31,30.26,31.2,33.04,34.020000000000003,35.01,36,37.979999999999997,39,40.03,41.06,42.1,43.14,45.33,46.41,47.49,48.57,49.66,50.76,53.17,52.96,55.43,56.57,57.72,58.86,60.02,61.18,63.88,65.08,66.28,67.48,68.7,69.91,71.13]
[null,{"$f":"C77","v":18},null,"Sum of MPN",21.82,23.07,24.33,25.59,26.86,28.13,29.41,30.69,31.97,33.270000000000003,34.56,35.86,37.17,38.479999999999997,39.79,41.11,42.44,43.77,45.11,46.45,47.79,49.15,50.5,51.87,53.23,54.61,55.98,57.37,58.76,60.15,61.55,62.96,64.37,65.790000000000006,67.209999999999994,68.64,70.08,71.52,72.959999999999994,74.42,75.87,77.34,78.81,80.290000000000006,81.77,83.26,84.75,86.25,87.76]
[{"$f":"C77","v":18},null,null,"Sum of 95U_Limit",33.9,35.69,37.06,38.36,39.81,41.26,42.71,44.2,45.68,47.21,48.77,50.34,51.18,52.84,54.51,56.12,57.41,58.86,60.16,61.84,63.44,64.739999999999995,66.11,67.790000000000006,69.09,70.69,72.209999999999994,73.66,75.11,76.56,77.86,79.540000000000006,81.37,82.97,84.19,85.33,87.32,89.23,89.99,91.59,93.88,94.6,96.13,98.57,99.18,101.01,102.84,103.76,106.2]
[null,null,19,"Sum of 95L_Limit",14.36,15.14,16.440000000000001,17.25,18.07,19.47,20.93,21.81,22.69,23.58,25.18,26.1,27.02,27.94,29.69,30.65,31.61,32.58,34.47,35.47,36.479999999999997,37.49,39.53,40.58,41.63,42.68,43.74,44.81,47.06,48.17,49.27,50.38,51.49,53.95,53.74,56.26,57.42,58.58,59.76,60.93,62.12,64.87,66.09,67.319999999999993,68.55,69.790000000000006,71.03,72.28,73.53]
[null,{"$f":"C80","v":19},null,"Sum of MPN",23.34,24.62,25.9,27.18,28.47,29.76,31.06,32.369999999999997,33.68,34.99,36.31,37.64,38.97,40.299999999999997,41.64,42.99,44.34,45.7,47.06,48.43,49.81,51.19,52.57,53.96,55.36,56.76,58.17,59.59,61.01,62.43,63.86,65.3,66.75,68.2,69.650000000000006,71.12,72.59,74.06,75.540000000000006,77.03,78.53,80.03,81.540000000000006,83.05,84.57,86.1,87.63,89.17,90.72]
[{"$f":"C80","v":19},null,null,"Sum of 95U_Limit",36.11,37.64,39.090000000000003,40.19,41.79,43.43,44.92,46.45,47.97,49.54,51.02,51.98,53.68,55.35,56.96,58.02,59.78,61.3,62.6,64.2,65.959999999999994,67.25,69.010000000000005,70.38,71.680000000000007,73.430000000000007,75.040000000000006,76.41,77.78,79.459999999999994,81.22,82.66,83.73,85.26,87.32,89.07,89.76,91.59,93.88,94.6,96.13,98.57,99.49,101.01,103.3,103.91,106.2,107.57,109.1]
[null,null,20,"Sum of 95L_Limit",15.81,16.64,17.46,18.29,19.71,20.58,22.08,22.98,23.88,25.5,26.43,27.37,28.31,30.08,31.05,32.03,33.020000000000003,34.94,35.950000000000003,36.979999999999997,38.01,40.08,41.14,42.21,43.29,44.37,45.45,47.75,48.87,49.99,51.12,52.26,53.4,55.93,57.11,58.3,59.49,60.68,61.89,63.09,64.31,65.53,68.400000000000006,69.66,70.92,72.2,73.47,74.760000000000005,76.05]
[null,{"$f":"C83","v":20},null,"Sum of MPN",24.91,26.21,27.51,28.82,30.13,31.45,32.770000000000003,34.1,35.44,36.770000000000003,38.119999999999997,39.47,40.83,42.19,43.56,44.93,46.31,47.7,49.09,50.49,51.89,53.3,54.72,56.14,57.57,59,60.44,61.89,63.34,64.8,66.27,67.739999999999995,69.22,70.709999999999994,72.2,73.7,75.2,76.72,78.239999999999995,79.760000000000005,81.3,82.84,84.39,85.94,87.5,89.07,90.65,92.23,93.82]
[{"$f":"C83","v":20},null,null,"Sum of 95U_Limit",38.090000000000003,39.700000000000003,41.18,42.71,44.2,45.68,47.17,48.77,50.34,51.18,52.82,54.51,56.19,57.57,59.02,60.69,62.45,63.59,65.42,66.569999999999993,68.48,69.7,71.45,72.98,74.349999999999994,75.88,77.63,79.31,80.760000000000005,82.28,83.43,85.26,87.32,88.69,89.61,91.59,93.88,94.6,96.13,98.57,99.49,101.01,103.3,104.37,106.2,108.03,109.1,111.39,112.76]
[null,null,21,"Sum of 95L_Limit",16.84,18.22,18.52,19.36,20.84,21.71,23.27,24.18,25.83,26.78,27.73,28.68,30.48,31.47,32.47,33.47,35.409999999999997,36.450000000000003,37.49,38.54,39.590000000000003,41.73,42.82,43.91,45.01,46.11,48.45,49.59,50.74,51.9,53.05,54.22,56.79,58,59.21,60.43,61.65,62.88,64.11,65.349999999999994,68.239999999999995,69.53,70.81,72.11,73.41,74.72,76.03,79.22,78.680000000000007]
[null,{"$f":"C86","v":21},null,"Sum of MPN",26.53,27.85,29.17,30.51,31.84,33.19,34.54,35.89,37.25,38.619999999999997,39.99,41.37,42.75,44.14,45.54,46.94,48.35,49.77,51.19,52.62,54.05,55.5,56.94,58.4,59.86,61.33,62.8,64.28,65.77,67.27,68.77,70.28,71.8,73.319999999999993,74.849999999999994,76.39,77.94,79.489999999999995,81.05,82.62,84.19,85.78,87.37,88.96,90.57,92.18,93.81,95.44,97.07]
[{"$f":"C86","v":21},null,null,"Sum of 95U_Limit",40.08,41.26,43.09,44.77,46.37,47.9,49.5,51.02,51.98,53.68,55.35,57.11,58.56,60.08,61.61,62.98,64.739999999999995,66.11,67.790000000000006,69.16,70.92,72.44,74.040000000000006,75.8,77.55,79.23,80.599999999999994,81.67,83.35,85.26,87.24,88.61,89.45,91.59,93.88,94.6,96.13,98.57,99.79,101.01,103.61,104.67,106.2,108.33,109.4,111.84,112.91,114.9,116.42]
[null,null,22,"Sum of 95L_Limit",17.899999999999999,18.75,19.61,21.1,21.99,23.57,24.5,26.17,27.13,28.1,29.07,30.89,31.9,32.909999999999997,33.93,34.950000000000003,36.97,38.03,39.090000000000003,40.159999999999997,41.24,43.45,44.56,45.68,46.81,47.94,50.35,51.52,52.7,53.88,55.07,56.26,58.92,60.16,61.4,62.65,63.91,65.17,66.44,69.39,70.7,72.02,73.349999999999994,74.680000000000007,76.02,77.37,78.72,82.01,83.42]
[null,{"$f":"C89","v":22},null,"Sum of MPN",28.2,29.54,30.89,32.25,33.61,34.979999999999997,36.36,37.74,39.130000000000003,40.520000000000003,41.93,43.33,44.75,46.17,47.6,49.03,50.47,51.92,53.37,54.83,56.3,57.78,59.26,60.75,62.25,63.75,65.260000000000005,66.78,68.31,69.84,71.38,72.930000000000007,74.489999999999995,76.05,77.62,79.2,80.790000000000006,82.39,83.99,85.6,87.22,88.85,90.49,92.14,93.79,95.45,97.12,98.8,100.49]
[{"$f":"C89","v":22},null,null,"Sum of 95U_Limit",42.25,43.97,45.46,47.17,48.77,50.34,51.25,52.86,54.51,56.19,57.95,59.7,60.77,62.52,64.2,65.959999999999994,67.25,69.010000000000005,70.38,72.209999999999994,73.66,75.650000000000006,77.17,78.55,79.989999999999995,81.52,83.27,85.26,87.01,88.23,89.45,91.59,93.88,94.64,96.13,98.57,100.1,101.01,103.61,104.98,106.35,108.79,110.01,111.84,113.83,115.05,117.34,118.71,120.39]
[null,null,23,"Sum of 95L_Limit",18.989999999999998,20.47,21.38,22.28,23.88,24.83,25.77,26.72,28.48,29.47,30.46,32.340000000000003,33.369999999999997,34.409999999999997,35.450000000000003,37.5,38.58,39.659999999999997,40.75,41.85,42.95,45.23,46.37,47.52,48.68,51.13,51,53.53,54.74,55.95,57.17,58.4,61.15,62.42,63.7,64.98,66.27,67.569999999999993,68.88,70.19,73.28,74.64,76.010000000000005,77.38,78.760000000000005,80.150000000000006,81.55,82.96,86.4]
[null,{"$f":"C92","v":23},null,"Sum of MPN",29.92,31.29,32.67,34.049999999999997,35.450000000000003,36.840000000000003,38.25,39.659999999999997,41.08,42.5,43.93,45.37,46.82,48.27,49.73,51.2,52.67,54.15,55.64,57.14,58.64,60.15,61.67,63.2,64.73,66.27,67.83,69.38,70.95,72.53,74.11,75.7,77.3,78.91,80.52,82.15,83.78,85.43,87.08,88.74,90.41,92.08,93.77,95.47,97.17,98.89,100.61,102.35,104.09]
[{"$f":"C92","v":23},null,null,"Sum of 95U_Limit",44.43,45.99,47.67,49.19,51.02,52.21,53.75,55.35,57.11,58.86,60.16,61.84,63.59,65.42,66.569999999999993,68.48,70.31,71.680000000000007,73.430000000000007,75.040000000000006,76.41,77.86,79.540000000000006,81.37,83.27,85.26,86.94,87.78,89.45,91.59,93.88,94.64,96.13,98.57,100.4,101.16,103.61,105.59,106.35,108.95,110.32,112.15,113.98,115.35,117.49,119.17,121.15,123.13,124.66]
[null,null,24,"Sum of 95L_Limit",20.74,21.66,23.25,24.2,25.16,26.12,27.09,28.88,29.88,30.89,32.799999999999997,33.85,34.909999999999997,35.97,38.049999999999997,39.15,40.25,41.36,42.48,44.77,45.93,47.09,48.26,49.44,50.63,53.17,54.39,55.63,56.87,58.12,60.88,62.17,63.48,64.790000000000006,66.099999999999994,67.430000000000007,68.760000000000005,70.099999999999994,71.44,74.599999999999994,75.989999999999995,77.400000000000006,78.81,80.23,81.650000000000006,83.09,86.57,85.99,89.56]
[null,{"$f":"C95","v":24},null,"Sum of MPN",31.7,33.1,34.51,35.92,37.340000000000003,38.770000000000003,40.200000000000003,41.65,43.09,44.55,46.01,47.49,48.96,50.45,51.95,53.45,54.96,56.48,58,59.54,61.08,62.63,64.19,65.75,67.33,68.91,70.510000000000005,72.11,73.72,75.34,76.959999999999994,78.599999999999994,80.25,81.900000000000006,83.57,85.24,86.92,88.62,90.32,92.03,93.75,95.49,97.23,98.98,100.74,102.51,104.29,106.09,107.89]
[{"$f":"C95","v":24},null,null,"Sum of 95U_Limit",46.64,48.13,50.11,51.86,53.28,54.74,56.35,58.02,59.78,61.3,62.98,64.739999999999995,66.11,67.790000000000006,69.7,70.989999999999995,72.98,74.349999999999994,75.88,77.78,79.459999999999994,81.37,83.27,85.11,86.25,87.7,89.45,91.59,93.88,94.64,96.13,98.57,100.55,101.47,103.61,105.74,106.96,108.95,111.08,112.15,114.74,116.42,117.95,120.08,121.76,123.44,125.12,127.25,128.93]
[null,null,25,"Sum of 95L_Limit",21.95,22.88,23.82,25.51,26.49,28.27,29.28,30.31,31.33,33.28,34.35,35.42,36.5,37.590000000000003,39.74,40.86,42,43.14,45.47,46.65,47.84,49.04,50.24,51.45,54.04,55.29,56.56,57.83,59.11,60.39,61.69,64.58,65.930000000000007,67.28,68.63,70,71.37,72.760000000000005,74.150000000000006,77.41,78.849999999999994,80.3,81.760000000000005,83.23,84.71,86.19,89.8,91.34,92.89]
[null,{"$f":"C98","v":25},null,"Sum of MPN",33.549999999999997,34.979999999999997,36.409999999999997,37.86,39.31,40.770000000000003,42.23,43.71,45.19,46.68,48.18,49.69,51.2,52.72,54.25,55.79,57.34,58.9,60.46,62.04,63.62,65.209999999999994,66.81,68.430000000000007,70.040000000000006,71.67,73.31,74.959999999999994,76.62,78.28,79.959999999999994,81.650000000000006,83.34,85.05,86.77,88.49,90.23,91.98,93.73,95.5,97.28,99.07,100.87,102.68,104.51,106.34,108.19,110.04,111.91]
[{"$f":"C98","v":25},null,null,"Sum of 95U_Limit",48.93,51.18,52.55,54.04,55.89,57.34,59.02,60.69,62.52,64.2,65.959999999999994,67.25,69.010000000000005,70.69,72.44,74.040000000000006,75.88,77.63,79.459999999999994,81.22,82.97,84.57,86.17,87.39,89.45,91.59,93.88,94.64,96.13,98.57,101.01,101.62,103.61,106.2,107.27,109.1,111.39,112.76,114.9,116.42,118.25,120.39,121.91,124.2,126.03,128.02000000000001,130.15,132.13999999999999,133.66]
[null,null,26,"Sum of 95L_Limit",23.2,24.88,25.87,26.86,27.86,29.7,30.74,31.79,32.840000000000003,34.86,35.950000000000003,37.049999999999997,38.159999999999997,40.35,41.5,42.66,43.82,44.99,46.17,48.62,49.84,51.07,52.31,54.95,54.81,57.53,58.83,60.14,61.46,62.78,64.12,67.12,68.5,69.900000000000006,71.3,72.709999999999994,74.13,75.56,78.900000000000006,80.38,81.87,83.38,84.89,86.41,90.06,89.48,93.23,94.83,96.44]
[null,{"$f":"C101","v":26},null,"Sum of MPN",35.46,36.92,38.39,39.86,41.35,42.84,44.34,45.85,47.37,48.9,50.43,51.98,53.53,55.09,56.66,58.24,59.83,61.43,63.04,64.66,66.28,67.92,69.569999999999993,71.22,72.89,74.569999999999993,76.260000000000005,77.95,79.66,81.38,83.11,84.85,86.6,88.36,90.14,91.92,93.71,95.52,97.34,99.17,101.01,102.86,104.73,106.61,108.5,110.4,112.31,114.24,116.18]
[{"$f":"C101","v":26},null,null,"Sum of 95U_Limit",51.98,53.66,55.35,56.5,58.56,60.08,61.84,63.52,65.42,66.569999999999993,68.48,70.38,72.209999999999994,73.66,75.650000000000006,77.55,79.23,80.760000000000005,82.66,84.19,85.41,87.32,89.45,91.59,93.88,94.64,96.17,98.57,101.01,102.23,103.61,106.2,108.03,109.4,111.84,113.52,115.05,117.49,119.17,121.15,123.13,124.97,127.1,128.93,130.61000000000001,132.44,135.04,137.02000000000001,138.69999999999999]
[null,null,27,"Sum of 95L_Limit",24.5,26.24,27.25,28.27,29.29,31.2,32.270000000000003,33.340000000000003,35.39,36.5,37.630000000000003,38.76,40.99,42.16,43.34,44.53,45.73,46.93,49.43,50.68,51.94,53.21,55.9,55.77,58.54,59.87,61.22,62.57,63.93,65.3,68.37,69.790000000000006,71.22,72.66,74.11,75.569999999999993,77.05,80.459999999999994,81.99,83.53,85.08,86.64,88.21,89.79,91.38,95.22,94.59,98.54,100.21]
[null,{"$f":"C104","v":27},null,"Sum of MPN",37.44,38.93,40.44,41.95,43.47,45,46.54,48.08,49.64,51.21,52.78,54.36,55.96,57.56,59.18,60.8,62.43,64.08,65.73,67.400000000000006,69.069999999999993,70.760000000000005,72.45,74.16,75.88,77.61,79.349999999999994,81.099999999999994,82.87,84.64,86.43,88.23,90.04,91.86,93.69,95.54,97.4,99.27,101.16,103.05,104.96,106.89,108.82,110.77,112.74,114.71,116.7,118.71,120.72]
[{"$f":"C104","v":27},null,null,"Sum of 95U_Limit",54.5,55.89,57.41,59.7,60.77,62.98,64.739999999999995,66.11,67.790000000000006,69.7,71.680000000000007,73.430000000000007,75.040000000000006,77.17,78.55,80.599999999999994,82.28,83.73,85.33,87.32,89.45,91.59,93.88,94.64,96.17,98.57,101.01,102.54,103.76,106.2,108.33,109.56,111.84,113.83,115.35,117.95,119.78,121.76,123.74,125.88,127.56,129.38999999999999,131.97999999999999,133.66,135.34,137.78,140.07,142.05000000000001,144.19]
[null,null,28,"Sum of 95L_Limit",25.85,27.65,28.69,30.59,30.78,32.76,33.85,34.950000000000003,37.08,38.22,39.380000000000003,41.65,41.7,44.05,45.27,46.49,47.73,50.27,51.55,52.84,54.14,55.45,56.77,59.6,60.97,62.35,63.73,65.13,66.540000000000006,67.959999999999994,71.14,72.61,74.099999999999994,75.59,77.099999999999994,78.61,80.14,83.69,85.28,86.88,88.49,90.11,91.74,95.63,95.04,99.04,98.39,102.5,104.24]
[null,{"$f":"C107","v":28},null,"Sum of MPN",39.5,41.03,42.57,44.12,45.68,47.25,48.82,50.41,52.01,53.62,55.23,56.86,58.5,60.15,61.81,63.48,65.16,66.849999999999994,68.56,70.27,72,73.739999999999995,75.489999999999995,77.25,79.03,80.81,82.61,84.42,86.25,88.08,89.93,91.8,93.67,95.56,97.46,99.38,101.31,103.25,105.21,107.18,109.17,111.17,113.18,115.21,117.26,119.31,121.39,123.48,125.58]
[{"$f":"C107","v":28},null,null,"Sum of 95U_Limit",57.03,58.79,60.69,62.52,63.82,65.88,67.48,69.09,70.989999999999995,72.98,74.349999999999994,76.41,77.86,79.989999999999995,81.52,83.35,85.26,87.32,89.45,91.59,93.88,94.64,96.17,98.57,101.01,102.84,103.91,106.2,108.79,110.32,112.15,114.74,116.42,118.25,120.39,121.91,124.2,126.03,128.47,130.61000000000001,132.44,135.04,137.02000000000001,138.69999999999999,140.68,142.97,145.41,147.85,149.83000000000001]
[null,null,29,"Sum of 95L_Limit",28.06,29.12,30.18,31.25,33.270000000000003,34.380000000000003,35.51,36.64,38.840000000000003,40.020000000000003,41.21,42.4,44.8,46.04,47.29,48.55,51.15,51.1,53.79,55.12,56.46,57.81,60.71,62.11,63.53,64.959999999999994,66.39,67.84,69.3,72.56,74.08,75.61,77.150000000000006,78.7,80.260000000000005,81.84,83.43,87.13,88.78,90.44,92.12,93.81,95.51,99.57,98.96,103.13,104.93,106.74,108.57]
[null,{"$f":"C110","v":29},null,"Sum of MPN",41.65,43.21,44.79,46.38,47.98,49.59,51.21,52.84,54.48,56.14,57.8,59.48,61.16,62.86,64.569999999999993,66.290000000000006,68.03,69.77,71.53,73.3,75.08,76.88,78.69,80.510000000000005,82.35,84.2,86.06,87.94,89.83,91.73,93.65,95.58,97.53,99.49,101.47,103.46,105.47,107.49,109.53,111.58,113.65,115.74,117.84,119.96,122.09,124.24,126.41,128.59,130.80000000000001]
[{"$f":"C110","v":29},null,null,"Sum of 95U_Limit",59.78,61.38,63.36,65.349999999999994,67.180000000000007,68.48,70.69,72.290000000000006,74.12,75.88,77.78,79.540000000000006,81.37,83.27,85.26,87.32,89.45,91.59,93.88,94.64,96.17,98.57,101.01,103.3,104.67,106.35,108.95,111.08,112.76,114.9,116.88,119.17,121.15,123.13,124.97,127.25,129.08000000000001,131.68,133.66,135.34,138.09,140.38,142.21,144.19,146.33000000000001,148.91999999999999,151.66999999999999,153.5,155.94]
[null,null,30,"Sum of 95L_Limit",29.57,30.65,31.75,33.799999999999997,34.94,36.08,38.29,39.479999999999997,40.69,41.9,43.12,45.57,46.84,48.13,49.42,50.72,52.03,54.78,56.14,57.52,58.91,60.31,63.32,64.77,66.239999999999995,67.72,69.209999999999994,70.72,74.06,75.62,77.2,78.790000000000006,80.400000000000006,82.01,83.64,87.39,89.09,88.61,92.52,94.26,96.01,97.78,99.56,101.36,105.66,107.53,109.41,111.32,113.24]
[null,{"$f":"C113","v":30},null,"Sum of MPN",43.88,45.49,47.11,48.74,50.39,52.04,53.71,55.39,57.08,58.78,60.49,62.22,63.96,65.709999999999994,67.47,69.25,71.040000000000006,72.849999999999994,74.66,76.489999999999995,78.34,80.2,82.07,83.96,85.86,87.78,89.71,91.66,93.63,95.6,97.6,99.61,101.64,103.68,105.74,107.82,109.91,112.02,114.15,116.29,118.45,120.64,122.83,125.05,127.29,129.54,131.81,134.1,136.41]
[{"$f":"C113","v":30},null,null,"Sum of 95U_Limit",62.6,64.510000000000005,66.569999999999993,68.02,70.08,72.209999999999994,73.97,75.8,77.63,79.459999999999994,81.37,83.27,85.26,87.32,89.45,91.59,93.88,94.64,96.17,98.57,101.01,103.61,104.98,106.35,108.95,111.39,112.91,115.05,117.49,119.17,121.76,124.2,126.03,128.16999999999999,130.61000000000001,132.13999999999999,135.04,137.02000000000001,138.69999999999999,141.6,144.04,145.87,148.16,150.29,152.58000000000001,155.47999999999999,157.62,159.75,162.65]
[null,null,31,"Sum of 95L_Limit",31.14,32.26,34.35,35.51,36.68,37.869999999999997,39.06,41.39,42.63,43.88,46.38,47.68,49,50.32,51.66,53.01,55.81,57.22,58.63,60.06,61.5,62.95,66.08,67.599999999999994,69.12,70.66,72.209999999999994,73.78,75.349999999999994,78.89,80.540000000000006,82.19,83.87,85.55,87.26,88.97,92.95,94.74,96.54,98.36,100.2,102.05,103.93,105.81,110.31,112.28,114.26,116.27,118.29]
[null,{"$f":"C116","v":31},null,"Sum of MPN",46.22,47.87,49.54,51.22,52.91,54.61,56.33,58.06,59.8,61.55,63.32,65.099999999999994,66.900000000000006,68.709999999999994,70.53,72.37,74.22,76.09,77.97,79.87,81.790000000000006,83.71,85.66,87.62,89.6,91.59,93.6,95.63,97.67,99.73,101.81,103.91,106.02,108.16,110.31,112.48,114.67,116.88,119.11,121.35,123.62,125.91,128.22,130.54,132.88999999999999,135.26,137.65,140.07,142.5]
[{"$f":"C116","v":31},null,null,"Sum of 95U_Limit",65.5,67.48,69.31,71.680000000000007,73.66,75.569999999999993,77.55,79.459999999999994,81.37,83.27,85.26,87.32,89.45,91.59,93.88,94.64,96.17,98.53,101.01,103.61,105.74,106.96,109.1,111.84,113.83,115.35,117.95,120.39,121.91,124.66,127.1,128.93,131.53,133.66,135.34,138.69999999999999,140.38,142.66,145.41,147.85,149.99,152.28,154.72,156.55000000000001,159.75,162.35,163.87,167.84,168.75]
[null,null,32,"Sum of 95L_Limit",32.79,33.94,36.11,37.31,38.520000000000003,39.74,42.12,43.39,44.67,45.96,48.56,49.91,51.27,52.64,54.03,56.9,58.35,59.8,61.27,62.76,64.25,65.760000000000005,69.03,70.599999999999994,72.19,73.790000000000006,75.41,77.040000000000006,78.69,82.39,84.11,85.84,87.59,89.36,91.14,95.24,94.76,98.98,100.88,102.79,104.73,106.68,111.27,113.3,115.36,117.44,119.53,121.65,123.78]
[null,{"$f":"C119","v":32},null,"Sum of MPN",48.66,50.36,52.08,53.81,55.55,57.31,59.08,60.86,62.66,64.47,66.3,68.150000000000006,70,71.88,73.77,75.67,77.59,79.53,81.489999999999995,83.46,85.44,87.45,89.47,91.52,93.57,95.65,97.75,99.86,102,104.15,106.33,108.52,110.73,112.97,115.22,117.5,119.8,122.12,124.46,126.82,129.21,131.61000000000001,134.04,136.5,138.97999999999999,141.47999999999999,144,146.55000000000001,149.12]
[{"$f":"C119","v":32},null,null,"Sum of 95U_Limit",69.010000000000005,70.92,72.98,75.040000000000006,77.17,79.08,81.22,83.27,85.26,87.32,89.45,91.59,93.88,94.64,96.17,98.53,101.01,103.61,106.2,108.03,109.4,111.84,114.74,116.42,118.25,121.15,123.13,125.12,127.56,130.46,132.13999999999999,135.04,137.02000000000001,139.46,142.05000000000001,144.19,146.16999999999999,148.91999999999999,151.66999999999999,153.94999999999999,156.24,159.44999999999999,161.28,163.72,167.23,168.3,172.42,174.4,176.99]
[null,null,33,"Sum of 95L_Limit",34.520000000000003,36.729999999999997,37.96,39.200000000000003,40.450000000000003,42.88,44.18,45.5,46.82,49.48,50.87,52.27,53.68,55.1,58.05,59.54,61.04,62.55,64.08,65.63,67.180000000000007,70.540000000000006,72.17,73.81,75.47,77.150000000000006,78.84,80.55,84.36,86.14,87.95,89.77,91.61,95.77,95.34,99.64,101.6,103.58,105.58,107.6,109.65,111.71,113.79,118.69,120.87,123.07,125.29,127.54,129.81]
[null,{"$f":"C122","v":33},null,"Sum of MPN",51.22,52.98,54.75,56.53,58.33,60.15,61.98,63.82,65.680000000000007,67.56,69.45,71.36,73.290000000000006,75.23,77.19,79.17,81.17,83.19,85.22,87.27,89.34,91.44,93.55,95.68,97.83,100,102.19,104.41,106.64,108.9,111.18,113.48,115.81,118.16,120.53,122.93,125.35,127.79,130.26,132.76,135.27000000000001,137.82,140.38999999999999,142.99,145.61000000000001,148.27000000000001,150.94,153.65,156.38]
[{"$f":"C122","v":33},null,null,"Sum of 95U_Limit",72.290000000000006,74.27,76.41,78.55,80.599999999999994,82.97,85.11,87.24,89.23,91.59,93.88,94.64,96.17,98.53,101.01,103.61,106.2,108.33,110.32,112.15,114.9,117.49,119.17,121.76,124.2,126.03,128.93,130.61000000000001,133.66,135.34,138.69999999999999,140.53,142.97,145.87,148.16,150.9,153.04,155.94,158.68,160.66999999999999,163.72,167.23,168.3,172.42,174.4,176.99,180.81,182.1,186.38]
[null,null,34,"Sum of 95L_Limit",37.380000000000003,38.64,39.909999999999997,41.19,43.68,45.01,46.36,47.73,50.45,50.49,51.89,54.77,56.23,57.72,60.79,62.34,63.9,65.48,67.08,68.69,70.319999999999993,73.83,75.540000000000006,77.260000000000005,79,80.760000000000005,84.62,84.33,86.14,90.2,92.1,94.02,95.96,97.92,102.37,101.91,106.5,108.59,110.72,112.86,115.03,117.22,119.43,124.6,126.92,129.27000000000001,131.63999999999999,134.04,136.46]
[null,{"$f":"C125","v":34},null,"Sum of MPN",53.92,55.73,57.56,59.4,61.27,63.14,65.040000000000006,66.95,68.88,70.83,72.790000000000006,74.78,76.78,78.8,80.84,82.9,84.98,87.09,89.21,91.35,93.52,95.7,97.91,100.15,102.4,104.68,106.98,109.31,111.66,114.03,116.43,118.86,121.31,123.79,126.3,128.83000000000001,131.38999999999999,133.97999999999999,136.59,139.24,141.91,144.62,147.35,150.11000000000001,152.91,155.72999999999999,158.59,161.47,164.39]
[{"$f":"C125","v":34},null,null,"Sum of 95U_Limit",75.8,77.86,79.989999999999995,82.21,84.57,86.94,89.15,91.51,93.8,94.64,96.17,98.53,101.01,103.61,106.2,108.79,111.08,112.76,115.05,117.95,120.39,121.91,124.97,127.25,129.38999999999999,132.13999999999999,135.04,137.02000000000001,139.46,142.21,144.94999999999999,147.85,149.99,152.58000000000001,155.47999999999999,158.22999999999999,160.06,163.72,166.47,167.99,172.42,174.4,176.99,180.81,182.1,186.99,188.51,192.48,194.92]
[null,null,35,"Sum of 95L_Limit",39.35,40.65,41.97,43.29,44.63,47.28,48.68,50.09,51.52,52.97,55.92,57.43,58.96,60.5,62.06,65.34,66.97,68.63,70.3,71.989999999999995,73.69,75.42,79.17,80.98,82.81,84.66,86.53,88.42,92.63,94.61,96.62,98.65,100.71,102.78,107.48,109.66,111.86,114.1,116.35,118.64,120.95,123.29,125.66,128.06,130.47999999999999,136.13999999999999,138.68,141.25,143.86000000000001]
[null,{"$f":"C128","v":35},null,"Sum of MPN",56.76,58.63,60.53,62.44,64.37,66.31,68.28,70.27,72.27,74.3,76.34,78.41,80.5,82.61,84.74,86.89,89.07,91.26,93.49,95.73,98,100.3,102.62,104.97,107.34,109.74,112.16,114.62,117.1,119.61,122.15,124.71,127.31,129.94,132.6,135.29,138.01,140.76,143.55000000000001,146.37,149.22,152.11000000000001,155.03,157.99,160.97999999999999,164.01,167.07,170.17,173.3]
[{"$f":"C128","v":35},null,null,"Sum of 95U_Limit",79.540000000000006,81.52,83.66,86.17,88.61,90.37,92.96,94.64,96.4,98.76,101.16,103.61,106.2,108.95,111.39,113.83,115.35,118.25,121.15,123.13,126.03,128.16999999999999,130.61000000000001,133.66,135.34,138.69999999999999,140.68,144.04,146.16999999999999,148.91999999999999,151.97,154.72,157.01,159.9,163.57,165.7,167.99,172.42,174.4,176.99,181.42,182.94,187.29,190.04,192.78,195.84,198.89,202.85,205.91]
[null,null,36,"Sum of 95L_Limit",41.43,42.78,44.14,45.52,46.91,49.68,51.14,52.61,54.1,55.61,58.69,60.27,61.87,63.49,66.86,68.56,70.27,72.010000000000005,73.77,75.540000000000006,77.34,81.209999999999994,83.1,85.01,86.95,88.9,93.19,95.24,94.92,99.43,101.57,103.73,105.92,110.8,110.38,115.43,117.79,120.18,122.6,125.05,127.53,130.05000000000001,135.79,138.43,141.11000000000001,143.82,146.57,149.35,152.16]
[null,{"$f":"C131","v":36},null,"Sum of MPN",59.76,61.7,63.67,65.650000000000006,67.66,69.680000000000007,71.73,73.8,75.89,78,80.14,82.3,84.48,86.68,88.92,91.17,93.46,95.76,98.1,100.46,102.85,105.27,107.72,110.19,112.7,115.24,117.81,120.41,123.04,125.7,128.4,131.13,133.9,136.69999999999999,139.54,142.41,145.32,148.27000000000001,151.26,154.28,157.34,160.44999999999999,163.59,166.77,170,173.26,176.57,179.92,183.31]
[{"$f":"C131","v":36},null,null,"Sum of 95U_Limit",83.35,85.41,87.78,90.29,92.73,95.25,97.46,99.52,101.35,103.76,106.35,109.1,111.84,114.74,116.42,119.17,121.76,124.2,127.1,129.08000000000001,132.13999999999999,135.04,137.02000000000001,140.38,142.66,145.41,148.16,151.66999999999999,153.94999999999999,156.55000000000001,159.75,163.11000000000001,165.24,167.99,172.42,174.4,176.99,181.87,183.1,187.29,190.04,193.09,197.67,200.41,203.46,206.21,210.18,213.84,217.5]
[null,null,37,"Sum of 95L_Limit",43.64,45.04,46.46,47.89,50.73,52.24,53.76,55.3,56.86,60.04,61.67,63.33,65.010000000000005,66.709999999999994,70.25,72.03,73.84,75.67,77.52,79.400000000000006,83.41,83.23,87.39,89.42,91.47,93.55,95.66,97.8,102.5,104.75,107.03,109.34,111.69,114.06,116.48,118.92,124.4,126.97,129.58000000000001,132.22999999999999,134.91,137.63999999999999,140.4,146.65,149.55000000000001,152.5,155.49,158.52000000000001,161.59]
[null,{"$f":"C134","v":37},null,"Sum of MPN",62.94,64.959999999999994,67.010000000000005,69.069999999999993,71.16,73.28,75.41,77.569999999999993,79.760000000000005,81.97,84.2,86.47,88.76,91.08,93.42,95.8,98.2,100.63,103.1,105.59,108.12,110.68,113.28,115.9,118.57,121.26,124,126.77,129.57,132.41999999999999,135.31,138.22999999999999,141.19,144.19999999999999,147.25,150.34,153.47,156.65,159.87,163.13999999999999,166.45,169.81,173.21,176.67,180.17,183.72,187.32,190.97,194.67]
[{"$f":"C134","v":37},null,null,"Sum of 95U_Limit",87.39,89.61,91.97,95.56,98.3,100.13,102.58,104.52,106.96,109.4,112.15,114.9,117.49,120.24,121.91,124.97,127.56,130.61000000000001,133.66,135.34,138.69999999999999,142.05000000000001,144.19,147.85,149.99,152.58000000000001,155.94,159.44999999999999,162.65,164.63,167.99,172.42,174.4,176.99,181.87,184.16,187.29,191.87,194,197.97,200.41,205.29,209.26,212.31,215.67,219.33,222.69,226.96,229.71]
[null,null,38,"Sum of 95L_Limit",45.99,47.45,48.93,51.85,53.4,54.98,56.57,58.19,59.82,63.16,64.89,66.63,68.400000000000006,70.19,73.92,75.81,77.72,79.66,81.63,83.62,85.64,89.97,92.1,94.26,96.46,98.68,103.5,105.85,105.56,110.65,113.11,115.6,118.14,120.71,123.32,125.96,131.83000000000001,134.63,137.47,140.35,143.28,146.26,149.28,152.34,159.19999999999999,162.44,165.72,169.06,172.44]
[null,{"$f":"C137","v":38},null,"Sum of MPN",66.33,68.44,70.569999999999993,72.73,74.91,77.12,79.36,81.62,83.92,86.24,88.59,90.97,93.38,95.83,98.31,100.82,103.36,105.94,108.55,111.2,113.89,116.61,119.38,122.18,125.03,127.91,130.84,133.81,136.83000000000001,139.88999999999999,142.99,146.15,149.35,152.6,155.9,159.24,162.63999999999999,166.1,169.6,173.16,176.77,180.44,184.17,187.95,191.79,195.69,199.65,203.66,207.74]
[{"$f":"C137","v":38},null,null,"Sum of 95U_Limit",91.67,96.17,98.53,100.97,102.88,105.74,107.72,110.32,112.76,115.35,118.25,121,123.13,126.03,128.93,132.13999999999999,135.04,137.02000000000001,140.38,142.97,146.16999999999999,148.91999999999999,152.28,155.47999999999999,158.68,161.28,163.87,167.99,172.42,174.4,176.99,181.87,185.38,187.29,192.17,194.92,198.89,203.46,206.21,209.26,213.84,218.11,221.77,226.35,229.71,233.98,237.95,243.13,245.88]
[null,null,39,"Sum of 95L_Limit",48.5,50.03,53.03,54.64,56.28,57.93,59.61,61.31,63.03,66.55,68.37,70.209999999999994,72.08,73.98,75.91,77.86,81.97,84.04,86.14,88.26,92.77,95.03,94.85,99.64,102,104.4,106.84,109.32,114.67,117.29,119.96,122.67,125.43,128.22999999999999,131.08000000000001,133.97999999999999,140.31,143.38,146.5,149.68,152.91,156.19,159.53,166.85,170.38,173.97,177.62,181.33,185.1]
[null,{"$f":"C140","v":39},null,"Sum of MPN",69.95,72.150000000000006,74.39,76.650000000000006,78.94,81.260000000000005,83.61,86,88.41,90.86,93.35,95.86,98.42,101.01,103.64,106.31,109.01,111.76,114.55,117.38,120.26,123.18,126.14,129.15,132.21,135.32,138.47999999999999,141.69999999999999,144.96,148.28,151.65,155.08000000000001,158.57,162.11000000000001,165.71,169.38,173.1,176.89,180.74,184.66,188.65,192.7,196.81,201,205.26,209.58,213.98,218.45,222.99]
[{"$f":"C140","v":39},null,null,"Sum of 95U_Limit",98.53,101.05,103.57,106.2,108.79,111.39,113.83,115.51,119.17,121.61,124.2,127.56,130.61000000000001,133.66,135.34,138.69999999999999,142.21,145.41,148.16,151.66999999999999,154.72,158.22999999999999,160.66999999999999,163.72,167.99,172.42,174.4,176.99,181.87,185.54,187.83,192.78,196.75,200.41,203.77,208.04,212.31,215.67,219.33,223.6,228.49,233.67,236.11,242.52,244.96,251.37,254.12,260.52999999999997,264.49]
[null,null,40,"Sum of 95L_Limit",51.2,52.8,55.96,57.66,59.38,61.13,62.9,66.47,66.52,70.239999999999995,72.17,74.13,76.13,78.150000000000006,80.2,84.49,86.67,88.88,91.14,95.86,95.76,98.13,103.15,105.67,108.24,110.84,113.5,119.15,118.96,124.84,127.77,130.75,133.79,136.88,140.03,143.24,146.5,153.53,157.01,160.55000000000001,164.15,167.82,175.69,175.36,183.56,187.6,191.71,195.89,200.15]
[null,{"$f":"C143","v":40},null,"Sum of MPN",73.84,76.150000000000006,78.5,80.88,83.29,85.74,88.23,90.75,93.31,95.9,98.54,101.22,103.94,106.7,109.51,112.36,115.26,118.2,121.2,124.25,127.35,130.5,133.71,136.97,140.30000000000001,143.68,147.12,150.62,154.19,157.83000000000001,161.53,165.29,169.13,173.04,177.02,181.08,185.21,189.42,193.7,198.07,202.52,207.05,211.66,216.35,221.13,226,230.95,235.99,241.12]
[{"$f":"C143","v":40},null,null,"Sum of 95U_Limit",103.57,106.24,108.95,111.69,114.59,117.18,120.24,123.13,125.42,128.93,132.13999999999999,135.04,137.02000000000001,140.38,144.04,147.85,149.99,153.94999999999999,156.55000000000001,159.9,163.72,167.99,172.42,174.4,176.99,181.87,186.91,189.96,193.09,197.67,200.41,205.91,209.26,213.84,219.33,222.38,226.96,230.93,235.5,242.22,244.05,251.37,254.12,260.52999999999997,264.49,270.29000000000002,274.87,280.97000000000003,285.55]
[null,null,41,"Sum of 95L_Limit",54.11,55.8,57.52,60.93,62.76,64.61,66.489999999999995,68.400000000000006,72.27,74.3,76.36,78.459999999999994,80.59,82.77,87.24,89.56,91.91,94.31,94.24,99.24,101.77,107.07,106.99,109.68,115.34,118.21,121.13,124.12,130.38,133.57,133.44,140.13999999999999,143.53,146.99,150.52000000000001,154.12,161.69,165.54,169.46,173.46,177.55,186.1,185.97,194.89,194.72,204.03,208.74,213.53,218.41]
[null,{"$f":"C146","v":41},null,"Sum of MPN",78.040000000000006,80.48,82.96,85.47,88.03,90.63,93.26,95.94,98.67,101.44,104.26,107.12,110.04,113,116.02,119.1,122.23,125.42,128.66,131.97,135.35,138.78,142.29,145.86000000000001,149.51,153.22,157.02000000000001,160.88,164.83,168.86,172.97,177.17,181.45,185.82,190.28,194.84,199.48,204.23,209.07,214.01,219.05,224.19,229.44,234.78,240.24,245.8,251.46,257.24,263.12]
[{"$f":"C146","v":41},null,null,"Sum of 95U_Limit",108.95,111.84,114.9,117.95,121,124.05,126.34,130.46,133.66,136.1,139.31,142.66,146.16999999999999,149.07,152.58000000000001,156.09,159.75,163.72,167.99,172.42,174.4,176.99,181.87,187.21,190.11,194,198.89,203.46,206.21,212.31,215.67,221.77,226.35,229.71,235.5,240.69,243.44,251.37,254.12,260.52999999999997,266.02,270.29000000000002,277.92,282.19,290.13,294.39999999999998,302.02999999999997,306.91000000000003,314.54000000000002]
[null,null,42,"Sum of 95L_Limit",57.27,59.07,60.89,62.75,66.45,68.430000000000007,70.44,72.48,74.569999999999993,78.790000000000006,81.010000000000005,83.28,85.59,87.94,92.75,95.26,95.29,97.84,103.13,105.86,108.65,111.5,114.42,120.45,123.58,126.77,130.04,133.38999999999999,136.81,140.31,147.53,151.29,155.13,159.06,163.09,167.2,175.65,175.72,184.58,189.19,193.91,198.73,208.57,208.69,218.99,219.08,229.84,235.44,241.15]
[null,{"$f":"C149","v":42},null,"Sum of MPN",82.6,85.19,87.82,90.49,93.22,95.99,98.81,101.68,104.6,107.58,110.61,113.7,116.85,120.07,123.35,126.69,130.1,133.59,137.15,140.78,144.49,148.29,152.16,156.13,160.18,164.32,168.56,172.89,177.33,181.87,186.51,191.26,196.12,201.09,206.17,211.38,216.7,222.15,227.72,233.41,239.23,245.18,251.26,257.47000000000003,263.81,270.29000000000002,276.89,283.64,290.51]
[{"$f":"C149","v":42},null,null,"Sum of 95U_Limit",115.35,118.25,121.91,124.97,128.02000000000001,131.68,135.34,138.24,142.05000000000001,145.41,148.77000000000001,151.66999999999999,155.94,159.75,163.72,167.99,172.42,174.4,176.99,182.03,187.21,192.25,195,200.41,205.29,209.26,213.84,219.33,222.69,228.49,233.98,237.95,243.13,251.37,254.12,260.52999999999997,268.14999999999998,270.89999999999998,279.75,283.11,290.43,296.23,303.25,310.88,315.45,325.83,328.57,340.78,343.53]
[null,null,43,"Sum of 95L_Limit",60.73,62.65,64.599999999999994,68.459999999999994,70.540000000000006,72.67,74.83,77.040000000000006,79.290000000000006,81.599999999999994,86.25,88.71,91.24,93.81,96.45,99.15,101.91,107.53,110.5,113.54,116.66,119.86,123.14,126.5,133.32,133.47999999999999,140.66999999999999,144.49,148.4,152.41999999999999,160.51,160.79,169.31,173.88,178.58,187.92,188.32,198.16,198.57,208.91,214.49,220.2,226.04,232.02,238.13,244.38,256.81,263.49,270.31]
[null,{"$f":"C152","v":43},null,"Sum of MPN",87.59,90.36,93.17,96.03,98.95,101.93,104.97,108.07,111.23,114.46,117.76,121.12,124.57,128.09,131.69,135.37,139.13999999999999,143,146.94999999999999,151,155.15,159.4,163.76,168.22,172.81,177.51,182.33,187.28,192.36,197.57,202.92,208.41,214.04,219.82,225.75,231.84,238.08,244.47,251.03,257.74,264.62,271.67,278.88,286.25,293.79000000000002,301.51,309.38,317.43,325.64999999999998]
[{"$f":"C152","v":43},null,null,"Sum of 95U_Limit",123.13,126.03,129.08000000000001,132.13999999999999,136.71,140.38,143.88,147.24,151.66999999999999,155.47999999999999,158.22999999999999,163.26,167.84,172.11,174.4,176.99,182.03,187.21,192.86,197.74,200.41,206.21,212.31,215.67,221.77,226.96,233.67,237.95,243.13,251.37,254.12,260.52999999999997,269.68,273.33999999999997,280.97000000000003,287.68,294.39999999999998,302.02999999999997,306.91000000000003,315.45,322.77999999999997,328.57,340.78,343.53,356.34,360,372.36,378.46,388.23]
[null,null,44,"Sum of 95L_Limit",64.56,66.62,68.72,70.87,75.12,77.42,79.77,82.18,84.65,87.18,92.22,94.95,95.13,97.92,103.54,106.56,109.66,115.85,119.21,122.66,126.21,129.87,133.63,137.51,141.49,145.6,153.72,158.19,162.80000000000001,167.54,172.42,177.45,187.26,187.96,198.35,204.13,210.08,221.53,222.47,234.57,235.53,248.29,255.42,262.70999999999998,270.19,277.83,285.66000000000003,293.64999999999998,301.83]
[null,{"$f":"C155","v":44},null,"Sum of MPN",93.12,96.08,99.11,102.21,105.37,108.6,111.9,115.28,118.74,122.29,125.91,129.63,133.44,137.35,141.37,145.49,149.72,154.06,158.53,163.12,167.85,172.71,177.71,182.86,188.17,193.63,199.25,205.05,211.02,217.16,223.5,230.02,236.73,243.64,250.75,258.06,265.58,273.31,281.24,289.39,297.75,306.33,315.12,324.12,333.34,342.77,352.42,362.29,372.38]
[{"$f":"C155","v":44},null,null,"Sum of 95U_Limit",130.61000000000001,135.34,138.69999999999999,142.21,145.41,149.99,153.94999999999999,158.07,162.65,167.23,171.96,174.4,177.91,182.94,187.83,193.17,198.96,203.46,209.26,213.84,219.33,226.35,229.71,235.5,243.13,251.37,254.12,260.52999999999997,270.29000000000002,274.87,282.19,290.43,296.23,305.08,314.54000000000002,320.94,328.57,340.78,343.53,359.39,364.28,378.46,382.74,398.6,401.66,418.74,423.02,439.49,446.21]
[null,null,45,"Sum of 95L_Limit",68.84,71.069999999999993,73.36,75.7,78.099999999999994,80.56,83.08,85.67,90.82,93.64,96.53,99.5,102.57,105.72,111.96,115.4,118.96,122.63,126.42,130.33000000000001,134.38,142.26,146.71,151.30000000000001,156.06,160.99,170.4,175.81,176.82,187.2,193.19,199.39,205.78,212.39,219.21,231.96,233.48,247.04,254.91,263,278.01,279.85000000000002,295.73,297.58999999999997,314.38,316.24,333.96,344.11,354.51]
[null,{"$f":"C158","v":45},null,"Sum of MPN",99.28,102.5,105.8,109.18,112.64,116.19,119.83,123.56,127.4,131.35,135.4,139.58000000000001,143.87,148.30000000000001,152.86000000000001,157.56,162.41999999999999,167.43,172.6,177.95,183.47,189.19,195.1,201.22,207.54,214.09,220.87,227.89,235.15,242.65,250.42,258.44,266.74,275.3,284.14,293.25,302.64,312.3,322.25,332.48,342.99,353.78,364.86,376.21,387.86,399.79,412.02,424.54,437.37]
[{"$f":"C158","v":45},null,null,"Sum of 95U_Limit",140.38,144.19,148.91999999999999,152.58000000000001,156.55000000000001,160.66999999999999,165.24,170.13,176.38,180.35,184.01,189.96,195,199.88,206.21,212.31,215.67,222.69,228.49,235.5,243.13,251.37,254.12,260.52999999999997,270.29000000000002,279.75,283.11,294.39999999999998,302.02999999999997,310.88,318.2,328.57,340.78,343.53,360,365.5,378.31,388.23,401.66,413.86,423.02,439.49,446.21,466.96,472.45,495.64,498.69,524.92999999999995,526.15]
[null,null,46,"Sum of 95L_Limit",71.61,76.14,78.66,81.25,83.91,86.66,89.49,92.4,98.1,101.3,104.6,108.01,111.55,115.22,119.01,122.96,130.53,134.9,135.72,144.16,149.08000000000001,154.19,159.52000000000001,169.47,175.4,176.86,188,194.69,201.64,208.87,216.37,229.98,232.22,246.82,255.67,264.82,281.20999999999998,284,294.04000000000002,312.07,315,334.19,337.18,357.56,369.75,382.27,404.91,408.4,422.03]
[null,{"$f":"C161","v":46},null,"Sum of MPN",106.27,109.81,113.44,117.18,121.03,124.98,129.06,133.27000000000001,137.61000000000001,142.09,146.72,151.52000000000001,156.47999999999999,161.62,166.95,172.47,178.21,184.18,190.38,196.83,203.54,210.52,217.8,225.37,233.26,241.47,250.02,258.91000000000003,268.16000000000003,277.77,287.75,298.10000000000002,308.82,319.92,331.4,343.27,355.51,368.13,381.13,394.52,408.3,422.48,437.05,452.03,467.43,483.27,499.55,516.29999999999995,533.53]
[{"$f":"C161","v":46},null,null,"Sum of 95U_Limit",151.66999999999999,155.94,159.9,163.87,168.3,176.84,181.87,186.91,192.25,196.83,201.1,207.81,215.36,220.55,227.88,235.5,243.13,251.37,254.12,260.83,270.29000000000002,280.97000000000003,290.43,296.23,306.91000000000003,315.45,328.57,340.78,343.53,360,372.21,382.89,398.6,405.32,423.02,439.49,446.21,471.23,476.11,498.08,515.16999999999996,526.15,555.45000000000005,556.66999999999996,586.57000000000005,600.61,618.91999999999996,648.21,652.49]
[null,null,47,"Sum of 95L_Limit",79.27,82.01,84.84,85.29,88.22,91.26,97.15,100.52,104.01,107.65,111.43,115.37,119.49,123.78,131.88999999999999,136.72999999999999,141.79,147.1,152.66999999999999,158.52000000000001,169.17,175.8,177.88,184.99,197.72,205.75,214.16,217.01,232.14,248.16,251.68,262.04000000000002,280.07,299.08999999999997,295.49,315.64,336.85,341.43,354.98,378.57,393.41,398.42,424.64,441.08,458.12,487.84,494.15,513.24,546.62]
[null,{"$f":"C164","v":47},null,"Sum of MPN",114.33,118.28,122.36,126.57,130.93,135.44,140.12,144.97,150.01,155.25,160.71,166.4,172.33,178.53,185.01,191.79,198.9,206.35,214.16,222.36,230.98,240.03,249.53,259.5,269.95999999999998,280.92,292.39999999999998,304.41000000000003,316.94,330.02,343.62,357.77,372.45,387.68,403.44,419.76,436.62,454.06,472.08,490.7,509.94,529.84,550.41999999999996,571.73,593.82000000000005,616.73,640.52,665.26,691.03]
[{"$f":"C164","v":47},null,null,"Sum of 95U_Limit",163.72,167.99,176.99,181.87,187.21,192.71,198.81,204.76,211.78,218.72,226.35,233.98,242.22,250.46,256.25,264.49,273.33999999999997,283.11,294.39999999999998,303.25,315.45,328.57,340.78,343.53,360,378.31,388.38,401.81,423.02,439.49,446.21,471.23,495.64,498.69,526.15,555.45000000000005,556.66999999999996,586.57000000000005,618.91999999999996,623.79999999999995,652.49,687.88,700.09,724.5,763.56,786.44,804.75,847.47,886.53]
[null,null,48,"Sum of 95L_Limit",83.46,86.5,89.65,92.94,99.16,102.84,106.68,110.71,114.93,119.37,124.04,125.33,130.38,135.72,145.47999999999999,151.65,158.21,165.18,172.58,175.36,183.49,197.68,207.08,217.03,233.94,245.31,257.26,262.39999999999998,275.14,296.58,310.85000000000002,334.64,341.19,357.3,374.08,402.28,432.23,440.55,448.69,482.39,518.29999999999995,542.55999999999995,553.38,579.73,623.9,654.47,705.03,703.58,740.6]
[null,{"$f":"C167","v":48},null,"Sum of MPN",123.86,128.37,133.05000000000001,137.93,143.01,148.32,153.86000000000001,159.66999999999999,165.76,172.16,178.9,186,193.49,201.42,209.82,218.72,228.18,238.22,248.9,260.25,272.3,285.10000000000002,298.66000000000003,313.01,328.15,344.11,360.87,378.44,396.82,416.02,436.04,456.89,478.6,501.2,524.73,549.25,574.80999999999995,601.49,629.4,658.62,689.27,721.53,755.55,791.53,829.7,870.36,913.86,960.61,1011.16]
[{"$f":"C167","v":48},null,null,"Sum of 95U_Limit",181.87,187.21,192.86,198.96,206.29,212.39,222.38,229.71,237.95,244.96,257.77999999999997,268.76,279.45,284.02,301.11,314.54000000000002,323.08,340.78,350.24,365.19,382.89,398.76,423.17,439.49,448.04,472.45,498.69,526.15,555.45000000000005,556.66999999999996,586.57000000000005,618.91999999999996,652.49,687.88,700.09,724.5,763.56,804.45,847.47,886.53,892.63,941.46,993.94,1048.8699999999999,1108.68,1153.8399999999999,1174.5899999999999,1245.3800000000001,1323.5]
[null,null,49,"Sum of 95L_Limit",88.65,92.13,98.65,102.61,106.78,111.19,115.87,120.84,126.14,127.98,137.86000000000001,140.19,147.01,158.97,162.32,170.94,185.65,190.36,195.25,206.64,218.87,231.94,245.86,260.62,276.23,292.7,310.04000000000002,338.41,358.23,379.12,401.18,424.52,449.29,475.67,549,550.12,583.83000000000004,620.49,660.61,704.99,754.6,810.84,850.36,924.92,1016.2,1167.67,1222.03,1630.37,1439.5]
[null,{"$f":"C170","v":49},null,"Sum of MPN",135.49,140.81,146.4,152.27000000000001,158.47,165.02,171.96,179.34,187.19,195.59,204.59,214.26,224.68,235.93,248.09,261.25,275.51,290.93,307.58999999999997,325.54000000000002,344.8,365.4,387.32,410.58,435.17,461.11,488.44,517.21,547.5,579.42999999999995,613.14,648.82000000000005,686.67,726.99,770.1,816.41,866.44,920.84,980.39,1046.24,1119.8699999999999,1203.33,1299.6500000000001,1413.61,1553.12,1732.89,1986.29,2419.5700000000002,0]
[{"$f":"C170","v":49},null,null,"Sum of 95U_Limit",203.39,209.34,219.26,228.41,235.5,243.44,260.52999999999997,270.29000000000002,280.97000000000003,292.87,306.91000000000003,320.94,343.53,360,371.9,398.45,416.76,446.05,471.23,498.08,520.66,555.45000000000005,567.04,618.91999999999996,650.04,687.88,721.45,763.56,804.45,847.17,879.21,941.46,974.41,1048.8699999999999,1094.03,1174.5899999999999,1245.3800000000001,1282,1410.16,1509.03,1614,1750.7,1896.56,2101.62,2353.06,2709.47,3300.23,4716.1000000000004,0]